{"text_format":"1","workbook":"xlsx","n_sheets":11,"sheets":["0 Úvod","1 Celkové investiční náklady","2 Zůstatková hodnota","3 Provozní náklady","4 Tržby","5 Finanční analýza (FRR_C)","6 Kontrola dotací","7 Mezera ve financování","8 Finanční struktura","9 Udržitelnost","10 FRR_K"],"not_rendered":{"charts":0,"images":0,"macros":1,"external_links":0,"defined_names":11,"comments":4,"pivot_tables":0},"unopened":[],"bounds":{"document_bytes":16777216,"sheet_cells":100000,"rows_first":2000,"rows_last":500,"rows_between":2000,"halvings":0,"cell_chars":16384,"cell_head_chars":4096},"cells_cut":0,"cells_raw":0,"read":"whole","date_system":"1900"}

{"sheet":"0 Úvod","index":0,"n_rows":87,"n_cols":15,"rows_kept":87,"cut":false,"hidden":false,"merged":[[4,2,11,13],[16,3,16,13],[40,2,40,3],[25,1,28,1],[25,2,28,13],[30,1,33,1],[30,2,33,13],[41,2,41,3],[39,2,39,3]]}
[]
[]
[]
[null,null,"Úvod"]
[null,null,"Toto je jednoduchý finanční model, který doplňuje stávající výsledky analýz CBA obsažených ve studiích proveditelnosti a ekonomických hodnoceních českých železničních infrastrukturních projektů. Model je založen na analýze výnosů a je plně v souladu se současnou metodikou Evropské komise o CBA.\n\nPřipravil DG REGIO/F.2, SUDOP PRAHA a.s.\nAktualizoval SUDOP PRAHA a.s. 2016, verze 01-2017 (schválena CK MD 21. 2. 2017)"]
[]
[]
[]
[]
[]
[]
[]
[]
[]
[null,null,"Základní informace"]
[]
[null,null,"Zdroj dat:","Modernizace trati …"]
[]
[null,null,"Cenová úroveň (CÚ) ",2016,null,"Začátek stavebních prací",2016,null,"Doba hodnocení",30,null,null,"Směnný kurz (CZK/EUR) ",25.66]
[]
[null,null,"Diskontní sazba",0.04,null,"Začátek provozu",2018,null,null,null,null,null,"DPH",0.21]
[]
[]
[]
[null,null,"Hodnocené scénáře"]
[null,"BEZ PROJEKTU"]
[]
[]
[]
[]
[null,"S PROJEKTEM"]
[]
[]
[]
[]
[]
[]
[null,null,"Seznam tabulek"]
[]
[null,null,"List / tabulka",null,"Celk. investiční náklady","Zůstatková hodnota","Provozní náklady","Tržby","Fin. analýza (FRR_C)","Kontrola dotací","Mezera ve financování","Finanční struktura","Udržitelnost","FRR_K"]
[null,null,"V konstantních cenách*",null,"1.1.","2.1., 2.2","3.1., 3.2., 3.3","4.1., 4.2., 4.3","5.1.","6.1., 6.2., 6.3","7.1., 7.2","8.1.","9.1.","10.1."]
[null,null,"V běžných cenách**",null,"1.2.",null,null,null,null,null,"7.3.","8.2."]
[]
[null,null,"*  v případě \"stavebního souboru\" (např. tranzitní železniční koridor) - všechny tabulky se vztahují na celý projekt"]
[null,null,"** tabulky pro projektovou žádost"]
[]
[]
[]
[null,null,"Míra inflace"]
[]
[null,null,"rok",2006,2007,2008,2009,2010,2011,2012,2013,2014,2015,2016,"***"]
[null,null,"inflace",2.5000000000000001E-2,2.8000000000000001E-2,6.3E-2,0.01,1.4999999999999999E-2,1.9E-2,3.3000000000000002E-2,1.4E-2,4.0000000000000001E-3,3.0000000000000001E-3,0.01]
[null,null,null,1,1,1,1,1,1,1,{"$f":"J53*(1+K52)","v":1.014},{"$f":"K53*(1+L52)","v":1.0180560000000001},{"$f":"L53*(1+M52)","v":1.0211101679999999},{"$f":"M53*(1+N52)","v":1.0313212696799998}]
[null,null,"zdroj: Prováděcí pokyny pro hodnocení efektivnosti investic železničních staveb (č. 26/2013-910-IZD/3), MD 2013 - příloha A.2; ČNB (Zpráva o inflaci I/2016)"]
[]
[null,null,"Index cen stavebních prací"]
[]
[null,null,"rok",2006,2007,2008,2009,2010,2011,2012,2013,2014,2015,2016]
[null,null,"inflace",2.9000000000000001E-2,4.1000000000000002E-2,4.4999999999999998E-2,1.2E-2,-2E-3,-5.0000000000000001E-3,-7.0000000000000001E-3,-1.0999999999999999E-2,5.0000000000000001E-3,0,0]
[null,null,null,1,1,1,1,1,1,1,1,{"$f":"K60*(1+L59)","v":1.0049999999999999},{"$f":"L60*(1+M59)","v":1.0049999999999999},{"$f":"M60*(1+N59)","v":1.0049999999999999}]
[null,null,"zdroj: aktuálně platné opatření SFDI (č.j. 3029/SFDI/320079/8567/2015); ČSÚ"]
[]
[null,null,"*** pro další roky platí v souladu s Prováděcími pokyny hodnota 2,00%"]
[]
[null,null,"HDP na hlavu"]
[]
[" ",null,"rok",2005,2006,2007,2008,2009,2010,2011,2012,2013,2014,2015]
[null,null,"HDP na hlavu",6.2E-2,6.5000000000000002E-2,0.05,1.7000000000000001E-2,-5.3999999999999999E-2,0.02,2.1999999999999999E-2,-0.01,-5.0000000000000001E-3,1.7999999999999999E-2,4.7E-2]
[]
[null,null,"rok",2016,2017,2018,2019,2020,2030,2050]
[null,null,"HDP na hlavu",2.8000000000000001E-2,2.9000000000000001E-2,0.03,0.03,0.02,0.01,0.01]
[]
[null,null,"zdroj: Prováděcí pokyny pro hodnocení efektivnosti investic železničních staveb (č. 26/2013-910-IZD/3), MD 2013 - příloha A.2; ČSÚ; ČNB (Zpráva o inflaci I/2016)"]
[]
[]
[]
[null,null,"Růst reálných mezd"]
[]
[" ",null,"rok",2012,2013,2014,2015,2016,2017,2018,2019,2020,2030,2050]
[null,null,"růst mezd",-8.0000000000000002E-3,-1.4999999999999999E-2,1.9E-2,2.8000000000000001E-2,0.03,2.5000000000000001E-2,0.03,0.03,2.5000000000000001E-2,0.02,0.02]
[null,null,null,1,{"$f":"D81*(1+E80*'3 Provozní náklady'!$D$71)","v":0.98499999999999999},{"$f":"E81*(1+F80*'3 Provozní náklady'!$D$71)","v":1.0037149999999999},{"$f":"F81*(1+G80*'3 Provozní náklady'!$D$71)","v":1.0318190199999999},{"$f":"G81*(1+H80*'3 Provozní náklady'!$D$71)","v":1.0627735906},{"$f":"H81*(1+I80*'3 Provozní náklady'!$D$71)","v":1.089342930365},{"$f":"I81*(1+J80*'3 Provozní náklady'!$D$71)","v":1.12202321827595},{"$f":"J81*(1+K80*'3 Provozní náklady'!$D$71)","v":1.1556839148242286},{"$f":"K81*(1+L80*'3 Provozní náklady'!$D$71)","v":1.1845760126948341},{"$f":"L81*(1+M80*'3 Provozní náklady'!$D$71)^(M79-L79)","v":1.4439915495346414},{"$f":"M81*(1+N80*'3 Provozní náklady'!$D$71)^(N79-M79)","v":2.1456954828457491}]
[null,null,"zdroj: do r. 2016 vč. ČNB (Zpráva o inflaci I/2016); od r. 2017 vč. Prováděcí pokyny pro hodnocení efektivnosti investic železničních staveb (č. 26/2013-910-IZD/3), MD 2013 - příloha A.2"]
[]
[]
[]
[]
[null,null,"Vyplnit pouze žlutě podbarvené buňky!"]

{"sheet":"1 Celkové investiční náklady","index":1,"n_rows":69,"n_cols":21,"rows_kept":69,"cut":false,"hidden":false,"merged":[[65,1,66,15],[17,3,18,3],[17,4,18,4],[17,5,18,5],[33,3,34,3],[33,4,34,4],[33,5,34,5],[49,5,50,5],[2,5,3,5],[2,4,3,4],[2,3,3,3],[49,3,50,3],[49,4,50,4]]}
[]
[null,"1.1.","Celkové investiční náklady (CZK) *",null,null,null,"V roce"]
[null,"a","(konstantní ceny)",null,null,"Celk. projekt. náklady",{"$f":"'0 Úvod'!G19","v":2016},{"$f":"G3+1","v":2017},{"$f":"H3+1","v":2018},2019,2020,2021,2022,2023,2024,2025,2026,2027,2028,2029,2030]
[null,null,{"$f":"'0 Úvod'!D19","v":2016}]
[null,null,"Přípravná a projektová dokumentace",null,null,{"$f":"SUM(G5:U5,G20:U20)","v":0}]
[null,null,"Zábory a nákupy pozemků",null,null,{"$f":"SUM(G6:U6,G21:U21)","v":0}]
[null,null,"Stavby a konstrukce (stavební náklady)",null,null,0]
[null,null,"Stroje a zařízení",null,null,0]
[null,null,"Technická asistence, propagace",null,null,0]
[null,null,"Technický dozor",null,null,0]
[null,null,"Celkové investiční náklady bez rezervy  (konstantní ceny)",null,null,0,{"$f":"SUM(G5:G10)","v":0},0,0,0,0,0,0,0,0,0,0,0,0,0,0]
[null,null,"Rezerva",null,null,0]
[null,null,"Celkové investiční náklady včetně rezervy (konstantní ceny)",null,null,0,{"$f":"SUM(G11:G12)","v":0},{"$f":"SUM(H11:H12)","v":0},{"$f":"SUM(I11:I12)","v":0},0,0,0,0,0,0,0,0,0,0,0,{"$f":"SUM(U11:U12)","v":0}]
[null,null,{"$f":"'0 Úvod'!$N$21*1000","v":210},null,null,0,{"$f":"G13*$C14/1000","v":0},{"$f":"H13*$C14/1000","v":0},{"$f":"I13*$C14/1000","v":0},0,0,0,0,0,0,0,0,0,0,0,{"$f":"U13*$C14/1000","v":0}]
[null,null,"Celkové investiční náklady včetně DPH (konstantní ceny)",null,null,0,{"$f":"G14+G13","v":0},{"$f":"H14+H13","v":0},{"$f":"I14+I13","v":0},0,0,0,0,0,0,0,0,0,0,0,{"$f":"U14+U13","v":0}]
[]
[null,"1.1.","Celkové investiční náklady (CZK) *"]
[null,"b","(konstantní ceny)",null,null,null,{"$f":"U3+1","v":2031},{"$f":"G18+1","v":2032},{"$f":"H18+1","v":2033},2034,2035,2036,2037,2038,2039,2040,2041,2042,2043,2044,2045]
[null,null,{"$f":"'0 Úvod'!D19","v":2016}]
[null,null,{"$f":"C5","v":"Přípravná a projektová dokumentace"}]
[null,null,"Zábory a nákupy pozemků"]
[null,null,"Stavby a konstrukce (stavební náklady)"]
[null,null,"Stroje a zařízení"]
[null,null,"Technická asistence, propagace"]
[null,null,"Technický dozor"]
[null,null,"Celkové investiční náklady bez rezervy  (konstantní ceny)",null,null,null,{"$f":"SUM(G20:G25)","v":0},0,0,0,0,0,0,0,0,0,0,0,0,0,0]
[null,null,"Rezerva"]
[null,null,"Celkové investiční náklady včetně rezervy (konstantní ceny)",null,null,null,{"$f":"SUM(G26:G27)","v":0},0,0,0,0,0,0,0,0,0,0,0,0,0,0]
[null,null,{"$f":"'0 Úvod'!$N$21*1000","v":210},null,null,null,{"$f":"G28*$C29/1000","v":0},{"$f":"H28*$C29/1000","v":0},{"$f":"I28*$C29/1000","v":0},0,0,0,0,0,0,0,0,0,0,0,{"$f":"U28*$C29/1000","v":0}]
[null,null,"Celkové investiční náklady včetně DPH (konstantní ceny)",null,null,null,{"$f":"G29+G28","v":0},0,0,0,0,0,0,0,0,0,0,0,0,0,0]
[]
[]
[null,"1.2.","Celkové investiční náklady (CZK)"]
[null,"a","(běžné ceny)","Nezpůsobilé náklady","Způsobilé náklady","Celk. projekt. náklady",{"$f":"G3","v":2016},{"$f":"G34+1","v":2017},{"$f":"H34+1","v":2018},2019,2020,2021,2022,2023,2024,2025,2026,2027,2028,2029,2030]
[null,null,"Způsobilost nákladů **"]
[null,null,"Poplatky za plány/stavební projekt",{"$f":"F36-E36","v":0},null,{"$f":"SUM(G36:U36,G52:U52)","v":0}]
[null,null,"Nákup pozemků",0,null,{"$f":"SUM(G37:U37,G53:U53)","v":0}]
[null,null,"Výstavba",0,null,0]
[null,null,"Prostory a strojní zařízení nebo vybavení ",0,null,0]
[null,null,"Nepředvídané události",0,null,0]
[null,null,"Úprava ceny (v příslušném případě)",0,null,0]
[null,null,"Propagace",0,null,0]
[null,null,"Dozor v průběhu provádění výstavby",0,null,0]
[null,null,"Technická pomoc",0,null,0]
[null,null,"Celkové investiční náklady (běžné ceny)",{"$f":"SUM(D36:D44)","v":0},{"$f":"SUM(E36:E44)","v":0},0,{"$f":"SUM(G36:G44)","v":0},0,0,0,0,0,0,0,0,0,0,0,0,0,0]
[null,null,{"$f":"'0 Úvod'!$N$21*1000","v":210},{"$f":"D45*$C46/1000","v":0},{"$f":"E45*$C46/1000","v":0},0,{"$f":"G45*$C46/1000","v":0},{"$f":"H45*$C46/1000","v":0},{"$f":"I45*$C46/1000","v":0},0,0,0,0,0,0,0,0,0,0,0,{"$f":"U45*$C46/1000","v":0}]
[null,null,"Celkové investiční náklady vč. DPH (běžné ceny)",{"$f":"SUM(D45:D46)","v":0},{"$f":"SUM(E45:E46)","v":0},0,{"$f":"G46+G45","v":0},0,0,0,0,0,0,0,0,0,0,0,0,0,0]
[]
[null,"1.2.","Celkové investiční náklady (CZK)"]
[null,"b","(běžné ceny)",null,null,null,{"$f":"U34+1","v":2031},{"$f":"G50+1","v":2032},{"$f":"H50+1","v":2033},2034,2035,2036,2037,2038,2039,2040,2041,2042,2043,2044,2045]
[null,null,"Způsobilost nákladů **"]
[null,null,"Poplatky za plány/stavební projekt"]
[null,null,"Nákup pozemků"]
[null,null,"Výstavba"]
[null,null,"Prostory a strojní zařízení nebo vybavení "]
[null,null,"Nepředvídané události"]
[null,null,"Úprava ceny (v příslušném případě)"]
[null,null,"Propagace"]
[null,null,"Dozor v průběhu provádění výstavby"]
[null,null,"Technická pomoc"]
[null,null,"Celkové investiční náklady (běžné ceny)",null,null,null,{"$f":"SUM(G52:G60)","v":0},0,0,0,0,0,0,0,0,0,0,0,0,0,0]
[null,null,{"$f":"'0 Úvod'!$N$21*1000","v":210},null,null,null,{"$f":"G61*$C62/1000","v":0},{"$f":"H61*$C62/1000","v":0},{"$f":"I61*$C62/1000","v":0},0,0,0,0,0,0,0,0,0,0,0,{"$f":"U61*$C62/1000","v":0}]
[null,null,"Celkové investiční náklady vč. DPH (běžné ceny)",null,null,null,{"$f":"G62+G61","v":0},0,0,0,0,0,0,0,0,0,0,0,0,0,0]
[]
[]
[null,"Komentáře"]
[]
[null,"*  v případě \"souboru staveb\" (např. tranzitní železniční koridor) - celkové náklady se vztahují na celý projekt"]
[null,"**  jednotlivé položky odpovídají definici dle prováděcího Nařízení komise (EU) 2015/207 přílohy II, části C.1 "]

{"sheet":"2 Zůstatková hodnota","index":2,"n_rows":31,"n_cols":9,"rows_kept":31,"cut":false,"hidden":false,"merged":[[15,1,15,3],[18,8,18,9],[19,8,19,9]]}
[]
[null,"2.1.","Životnost investice (roky)","Náklady (CZK)","Vážení",null,"2.3.","Výpočet zůstatkové hodnoty"]
[null,null,"Zabezpečovací zařízení",null,{"$f":"D3*D20","v":0},null,null,"Celková životnost investice",{"$f":"$E$16","v":{"$error":"#DIV/0!"}}]
[null,null,"Sdělovací zařízení",null,{"$f":"D4*D21","v":0},null,null,"Délka provozní fáze hodnotícího období",{"$f":"'0 Úvod'!$J$19-('0 Úvod'!$G$21-'0 Úvod'!$G$19)","v":28}]
[null,null,"Silnoproudé rozvody a zařízení",null,0,null,null,"Životnost investice po skončení hodnotícího období",{"$f":"IF((I3-I4)<0,0,I3-I4)","v":{"$error":"#DIV/0!"}}]
[null,null,"Železniční svršek",null,0,null,null,"Průměrný nákladový peněžní tok (nediskontovaný)",{"$f":"SUM('5 Finanční analýza (FRR_C)'!E13:S13,'5 Finanční analýza (FRR_C)'!E25:S25)/('0 Úvod'!J19-('0 Úvod'!$G$21-'0 Úvod'!G19))","v":0}]
[null,null,"Železniční spodek",null,0,null,null,"ZŮSTATKOVÁ HODNOTA",{"$f":"IF((I6*(1/(1+'0 Úvod'!D21))*(((1/(1+'0 Úvod'!D21))^I5-1)/((1/(1+'0 Úvod'!D21))-1)))<0,0,I6*(1/(1+'0 Úvod'!D21))*(((1/(1+'0 Úvod'!D21))^I5-1)/((1/(1+'0 Úvod'!D21))-1)))","v":{"$error":"#DIV/0!"}}]
[null,null,"Mosty, propustky, zdi",null,0]
[null,null,"Tunely",null,0]
[null,null,"Komunikace a zpevněné plochy",null,0]
[null,null,"Trakce",null,0]
[null,null,"Inženýrské sítě (trubní vedení, kabelovody)",null,0]
[null,null,"Pozemní stavby, nástupiště a přístřešky",null,0]
[null,null,"Objekty ochrany životního prostředí",null,0]
[null,null,"CELKEM",{"$f":"SUM(D3:D14)","v":0},{"$f":"SUM(E3:E14)","v":0}]
[null,"Celková životnost investice (roky)",null,null,{"$f":"ROUND(E15/D15,0)","v":{"$error":"#DIV/0!"}}]
[]
[]
[null,"2.2.","Životnost jednotlivých prvků","roky",null,null,"2.4.","Diskont. zůstatková hodnota investic pro FA",{"$f":"I7*(1/(1+'0 Úvod'!D21)^('0 Úvod'!J19-1))","v":{"$error":"#DIV/0!"}}]
[null,null,"Zabezpečovací zařízení",{"$f":"100/5","v":20},null,null,null,"Diskontovaná zůstatková hodnota investic v EUR",{"$f":"I19/'0 Úvod'!N19","v":{"$error":"#DIV/0!"}}]
[null,null,"Sdělovací zařízení",20]
[null,null,"Silnoproudé rozvody a zařízení",20]
[null,null,"Železniční svršek",30]
[null,null,"Železniční spodek",60]
[null,null,"Mosty, propustky, zdi",75]
[null,null,"Tunely",90]
[null,null,"Komunikace a zpevněné plochy",20]
[null,null,"Trakce",30]
[null,null,"Inženýrské sítě (trubní vedení, kabelovody)",20]
[null,null,"Pozemní stavby, nástupiště a přístřešky",40]
[null,null,"Objekty ochrany životního prostředí",30]

{"sheet":"3 Provozní náklady","index":3,"n_rows":180,"n_cols":19,"rows_kept":180,"cut":false,"hidden":false,"merged":[[176,1,177,16],[85,17,86,17],[85,15,86,15],[68,17,69,17],[68,5,69,5],[157,4,158,4],[157,5,158,5],[157,6,158,6],[85,4,86,4],[85,5,86,5],[85,6,86,6],[85,7,86,7],[68,4,69,4],[68,10,69,10],[68,11,69,11],[85,8,86,8],[68,8,69,8],[85,12,86,12],[68,14,69,14],[68,15,69,15],[85,16,86,16],[121,17,122,17],[121,14,122,14],[103,11,104,11],[157,18,158,18],[139,17,140,17],[157,13,158,13],[157,14,158,14],[139,11,140,11],[157,7,158,7],[139,10,140,10],[121,9,122,9],[121,15,122,15],[139,14,140,14],[139,18,140,18],[121,18,122,18],[121,4,122,4],[121,5,122,5],[121,6,122,6],[157,15,158,15],[157,16,158,16],[157,17,158,17],[157,8,158,8],[157,9,158,9],[157,10,158,10],[157,11,158,11],[139,16,140,16],[157,12,158,12],[139,4,140,4],[139,5,140,5],[139,6,140,6],[139,7,140,7],[139,8,140,8],[139,9,140,9],[139,15,140,15],[121,7,122,7],[121,8,122,8],[85,13,86,13],[68,12,69,12],[68,13,69,13],[68,9,69,9],[85,9,86,9],[85,10,86,10],[103,12,104,12],[103,13,104,13],[139,12,140,12],[139,13,140,13],[38,6,39,6],[68,18,69,18],[23,18,24,18],[38,18,39,18],[23,4,24,4],[1,4,2,4],[1,5,2,5],[23,6,24,6],[31,4,32,4],[31,6,32,6],[8,4,9,4],[16,6,17,6],[8,5,9,5],[16,4,17,4],[23,5,24,5],[31,5,32,5],[16,5,17,5],[1,6,2,6],[8,6,9,6],[1,12,2,12],[38,11,39,11],[38,12,39,12],[23,10,24,10],[68,16,69,16],[8,12,9,12],[8,13,9,13],[23,9,24,9],[38,13,39,13],[38,9,39,9],[121,12,122,12],[121,13,122,13],[1,18,2,18],[85,18,86,18],[85,14,86,14],[103,18,104,18],[103,17,104,17],[103,14,104,14],[103,15,104,15],[103,16,104,16],[1,17,2,17],[38,16,39,16],[38,17,39,17],[1,14,2,14],[1,15,2,15],[1,16,2,16],[121,16,122,16],[8,16,9,16],[103,9,104,9],[1,8,2,8],[121,10,122,10],[121,11,122,11],[8,7,9,7],[23,8,24,8],[38,7,39,7],[31,8,32,8],[16,7,17,7],[31,7,32,7],[38,8,39,8],[8,8,9,8],[103,7,104,7],[31,10,32,10],[31,9,32,9],[8,10,9,10],[103,8,104,8],[103,10,104,10],[85,11,86,11],[68,7,69,7],[31,18,32,18],[8,17,9,17],[8,15,9,15],[8,14,9,14],[38,14,39,14],[38,15,39,15],[23,16,24,16],[16,18,17,18],[1,7,2,7],[8,11,9,11],[31,13,32,13],[31,14,32,14],[16,13,17,13],[16,14,17,14],[31,15,32,15],[23,11,24,11],[23,12,24,12],[23,13,24,13],[1,9,2,9],[1,10,2,10],[1,11,2,11],[8,9,9,9],[8,18,9,18],[1,13,2,13],[103,4,104,4],[103,5,104,5],[103,6,104,6],[51,1,53,1],[16,17,17,17],[16,12,17,12],[31,11,32,11],[16,8,17,8],[16,9,17,9],[16,10,17,10],[16,11,17,11],[31,12,32,12],[23,7,24,7],[38,4,39,4],[38,5,39,5],[16,15,17,15],[38,10,39,10],[23,17,24,17],[23,14,24,14],[23,15,24,15],[16,16,17,16],[31,16,32,16],[31,17,32,17],[68,6,69,6]]}
[]
[null,"3.1.","Celkové provozní náklady (CZK)",null,{"$f":"'1 Celkové investiční náklady'!G3","v":2016},{"$f":"E2+1","v":2017},2018,2019,2020,2021,2022,2023,2024,2025,2026,2027,2028,2029,2030]
[null,"a","Scénář s projektem","Celkem"]
[null,null,"Náklady na údržbu a provoz infrastruktury",{"$f":"SUM(E4:S4,E11:S11)","v":0}]
[null,null,"Periodické provozní náklady / opravy",{"$f":"SUM(E5:S5,E12:S12)","v":0}]
[null,null,"Náklady na řízení provozu",0,{"$f":"IF(E2<=('0 Úvod'!$G$19+'0 Úvod'!$J$19-1),SUMPRODUCT(E72:E84,E106:E118)+E120,0)","v":0},{"$f":"IF(F2<=('0 Úvod'!$G$19+'0 Úvod'!$J$19-1),SUMPRODUCT(F72:F84,F106:F118)+F120,0)","v":0},{"$f":"IF(G2<=('0 Úvod'!$G$19+'0 Úvod'!$J$19-1),SUMPRODUCT(G72:G84,G106:G118)+G120,0)","v":0},{"$f":"IF(H2<=('0 Úvod'!$G$19+'0 Úvod'!$J$19-1),SUMPRODUCT(H72:H84,H106:H118)+H120,0)","v":0},{"$f":"IF(I2<=('0 Úvod'!$G$19+'0 Úvod'!$J$19-1),SUMPRODUCT(I72:I84,I106:I118)+I120,0)","v":0},{"$f":"IF(J2<=('0 Úvod'!$G$19+'0 Úvod'!$J$19-1),SUMPRODUCT(J72:J84,J106:J118)+J120,0)","v":0},{"$f":"IF(K2<=('0 Úvod'!$G$19+'0 Úvod'!$J$19-1),SUMPRODUCT(K72:K84,K106:K118)+K120,0)","v":0},{"$f":"IF(L2<=('0 Úvod'!$G$19+'0 Úvod'!$J$19-1),SUMPRODUCT(L72:L84,L106:L118)+L120,0)","v":0},{"$f":"IF(M2<=('0 Úvod'!$G$19+'0 Úvod'!$J$19-1),SUMPRODUCT(M72:M84,M106:M118)+M120,0)","v":0},{"$f":"IF(N2<=('0 Úvod'!$G$19+'0 Úvod'!$J$19-1),SUMPRODUCT(N72:N84,N106:N118)+N120,0)","v":0},{"$f":"IF(O2<=('0 Úvod'!$G$19+'0 Úvod'!$J$19-1),SUMPRODUCT(O72:O84,O106:O118)+O120,0)","v":0},{"$f":"IF(P2<=('0 Úvod'!$G$19+'0 Úvod'!$J$19-1),SUMPRODUCT(P72:P84,P106:P118)+P120,0)","v":0},{"$f":"IF(Q2<=('0 Úvod'!$G$19+'0 Úvod'!$J$19-1),SUMPRODUCT(Q72:Q84,Q106:Q118)+Q120,0)","v":0},{"$f":"IF(R2<=('0 Úvod'!$G$19+'0 Úvod'!$J$19-1),SUMPRODUCT(R72:R84,R106:R118)+R120,0)","v":0},{"$f":"IF(S2<=('0 Úvod'!$G$19+'0 Úvod'!$J$19-1),SUMPRODUCT(S72:S84,S106:S118)+S120,0)","v":0}]
[null,null,"Celkové provozní náklady",0,{"$f":"SUM(E4:E6)","v":0},{"$f":"SUM(F4:F6)","v":0},0,0,0,0,0,0,0,0,0,0,0,0,0]
[]
[null,"3.1.","Celkové provozní náklady (CZK)",null,{"$f":"S2+1","v":2031},{"$f":"E9+1","v":2032},2033,2034,2035,2036,2037,2038,2039,2040,2041,2042,2043,2044,2045]
[null,"b","Scenář s projektem"]
[null,null,{"$f":"C4","v":"Náklady na údržbu a provoz infrastruktury"}]
[null,null,{"$f":"C5","v":"Periodické provozní náklady / opravy"}]
[null,null,{"$f":"C6","v":"Náklady na řízení provozu"},null,{"$f":"IF(E9<=('0 Úvod'!$G$19+'0 Úvod'!$J$19-1),SUMPRODUCT(E89:E101,E124:E136)+E138,0)","v":0},{"$f":"IF(F9<=('0 Úvod'!$G$19+'0 Úvod'!$J$19-1),SUMPRODUCT(F89:F101,F124:F136)+F138,0)","v":0},{"$f":"IF(G9<=('0 Úvod'!$G$19+'0 Úvod'!$J$19-1),SUMPRODUCT(G89:G101,G124:G136)+G138,0)","v":0},{"$f":"IF(H9<=('0 Úvod'!$G$19+'0 Úvod'!$J$19-1),SUMPRODUCT(H89:H101,H124:H136)+H138,0)","v":0},{"$f":"IF(I9<=('0 Úvod'!$G$19+'0 Úvod'!$J$19-1),SUMPRODUCT(I89:I101,I124:I136)+I138,0)","v":0},{"$f":"IF(J9<=('0 Úvod'!$G$19+'0 Úvod'!$J$19-1),SUMPRODUCT(J89:J101,J124:J136)+J138,0)","v":0},{"$f":"IF(K9<=('0 Úvod'!$G$19+'0 Úvod'!$J$19-1),SUMPRODUCT(K89:K101,K124:K136)+K138,0)","v":0},{"$f":"IF(L9<=('0 Úvod'!$G$19+'0 Úvod'!$J$19-1),SUMPRODUCT(L89:L101,L124:L136)+L138,0)","v":0},{"$f":"IF(M9<=('0 Úvod'!$G$19+'0 Úvod'!$J$19-1),SUMPRODUCT(M89:M101,M124:M136)+M138,0)","v":0},{"$f":"IF(N9<=('0 Úvod'!$G$19+'0 Úvod'!$J$19-1),SUMPRODUCT(N89:N101,N124:N136)+N138,0)","v":0},{"$f":"IF(O9<=('0 Úvod'!$G$19+'0 Úvod'!$J$19-1),SUMPRODUCT(O89:O101,O124:O136)+O138,0)","v":0},{"$f":"IF(P9<=('0 Úvod'!$G$19+'0 Úvod'!$J$19-1),SUMPRODUCT(P89:P101,P124:P136)+P138,0)","v":0},{"$f":"IF(Q9<=('0 Úvod'!$G$19+'0 Úvod'!$J$19-1),SUMPRODUCT(Q89:Q101,Q124:Q136)+Q138,0)","v":0},{"$f":"IF(R9<=('0 Úvod'!$G$19+'0 Úvod'!$J$19-1),SUMPRODUCT(R89:R101,R124:R136)+R138,0)","v":0},{"$f":"IF(S9<=('0 Úvod'!$G$19+'0 Úvod'!$J$19-1),SUMPRODUCT(S89:S101,S124:S136)+S138,0)","v":0}]
[null,null,{"$f":"C7","v":"Celkové provozní náklady"},null,{"$f":"SUM(E11:E13)","v":0},0,0,0,0,0,0,0,0,0,0,0,0,0,0]
[]
[]
[null,"3.2.","Celkové provozní náklady (CZK)",null,{"$f":"E2","v":2016},{"$f":"E17+1","v":2017},2018,2019,2020,2021,2022,2023,2024,2025,2026,2027,2028,2029,2030]
[null,"a","Scénář bez projektu","Celkem"]
[null,null,"Náklady na údržbu a provoz infrastruktury",{"$f":"SUM(E19:S19,E26:S26)","v":0}]
[null,null,"Periodické provozní náklady / opravy",{"$f":"SUM(E20:S20,E27:S27)","v":0}]
[null,null,"Náklady na řízení provozu",0,{"$f":"IF(E17<=('0 Úvod'!$G$19+'0 Úvod'!$J$19-1),SUMPRODUCT(E72:E84,E142:E154)+E156,0)","v":0},{"$f":"IF(F17<=('0 Úvod'!$G$19+'0 Úvod'!$J$19-1),SUMPRODUCT(F72:F84,F142:F154)+F156,0)","v":0},{"$f":"IF(G17<=('0 Úvod'!$G$19+'0 Úvod'!$J$19-1),SUMPRODUCT(G72:G84,G142:G154)+G156,0)","v":0},{"$f":"IF(H17<=('0 Úvod'!$G$19+'0 Úvod'!$J$19-1),SUMPRODUCT(H72:H84,H142:H154)+H156,0)","v":0},{"$f":"IF(I17<=('0 Úvod'!$G$19+'0 Úvod'!$J$19-1),SUMPRODUCT(I72:I84,I142:I154)+I156,0)","v":0},{"$f":"IF(J17<=('0 Úvod'!$G$19+'0 Úvod'!$J$19-1),SUMPRODUCT(J72:J84,J142:J154)+J156,0)","v":0},{"$f":"IF(K17<=('0 Úvod'!$G$19+'0 Úvod'!$J$19-1),SUMPRODUCT(K72:K84,K142:K154)+K156,0)","v":0},{"$f":"IF(L17<=('0 Úvod'!$G$19+'0 Úvod'!$J$19-1),SUMPRODUCT(L72:L84,L142:L154)+L156,0)","v":0},{"$f":"IF(M17<=('0 Úvod'!$G$19+'0 Úvod'!$J$19-1),SUMPRODUCT(M72:M84,M142:M154)+M156,0)","v":0},{"$f":"IF(N17<=('0 Úvod'!$G$19+'0 Úvod'!$J$19-1),SUMPRODUCT(N72:N84,N142:N154)+N156,0)","v":0},{"$f":"IF(O17<=('0 Úvod'!$G$19+'0 Úvod'!$J$19-1),SUMPRODUCT(O72:O84,O142:O154)+O156,0)","v":0},{"$f":"IF(P17<=('0 Úvod'!$G$19+'0 Úvod'!$J$19-1),SUMPRODUCT(P72:P84,P142:P154)+P156,0)","v":0},{"$f":"IF(Q17<=('0 Úvod'!$G$19+'0 Úvod'!$J$19-1),SUMPRODUCT(Q72:Q84,Q142:Q154)+Q156,0)","v":0},{"$f":"IF(R17<=('0 Úvod'!$G$19+'0 Úvod'!$J$19-1),SUMPRODUCT(R72:R84,R142:R154)+R156,0)","v":0},{"$f":"IF(S17<=('0 Úvod'!$G$19+'0 Úvod'!$J$19-1),SUMPRODUCT(S72:S84,S142:S154)+S156,0)","v":0}]
[null,null,"Celkové provozní náklady",0,{"$f":"SUM(E19:E21)","v":0},0,0,0,0,0,0,0,0,0,0,0,0,0,0]
[]
[null,"3.2.","Celkové provozní náklady (CZK)",null,{"$f":"S17+1","v":2031},{"$f":"E24+1","v":2032},2033,2034,2035,2036,2037,2038,2039,2040,2041,2042,2043,2044,2045]
[null,"b","Scénář bez projektu",null,{"$f":"S18+1","v":1}]
[null,null,{"$f":"C19","v":"Náklady na údržbu a provoz infrastruktury"}]
[null,null,{"$f":"C20","v":"Periodické provozní náklady / opravy"}]
[null,null,{"$f":"C21","v":"Náklady na řízení provozu"},null,{"$f":"IF(E24<=('0 Úvod'!$G$19+'0 Úvod'!$J$19-1),SUMPRODUCT(E89:E101,E160:E172)+E174,0)","v":0},{"$f":"IF(F24<=('0 Úvod'!$G$19+'0 Úvod'!$J$19-1),SUMPRODUCT(F89:F101,F160:F172)+F174,0)","v":0},{"$f":"IF(G24<=('0 Úvod'!$G$19+'0 Úvod'!$J$19-1),SUMPRODUCT(G89:G101,G160:G172)+G174,0)","v":0},{"$f":"IF(H24<=('0 Úvod'!$G$19+'0 Úvod'!$J$19-1),SUMPRODUCT(H89:H101,H160:H172)+H174,0)","v":0},{"$f":"IF(I24<=('0 Úvod'!$G$19+'0 Úvod'!$J$19-1),SUMPRODUCT(I89:I101,I160:I172)+I174,0)","v":0},{"$f":"IF(J24<=('0 Úvod'!$G$19+'0 Úvod'!$J$19-1),SUMPRODUCT(J89:J101,J160:J172)+J174,0)","v":0},{"$f":"IF(K24<=('0 Úvod'!$G$19+'0 Úvod'!$J$19-1),SUMPRODUCT(K89:K101,K160:K172)+K174,0)","v":0},{"$f":"IF(L24<=('0 Úvod'!$G$19+'0 Úvod'!$J$19-1),SUMPRODUCT(L89:L101,L160:L172)+L174,0)","v":0},{"$f":"IF(M24<=('0 Úvod'!$G$19+'0 Úvod'!$J$19-1),SUMPRODUCT(M89:M101,M160:M172)+M174,0)","v":0},{"$f":"IF(N24<=('0 Úvod'!$G$19+'0 Úvod'!$J$19-1),SUMPRODUCT(N89:N101,N160:N172)+N174,0)","v":0},{"$f":"IF(O24<=('0 Úvod'!$G$19+'0 Úvod'!$J$19-1),SUMPRODUCT(O89:O101,O160:O172)+O174,0)","v":0},{"$f":"IF(P24<=('0 Úvod'!$G$19+'0 Úvod'!$J$19-1),SUMPRODUCT(P89:P101,P160:P172)+P174,0)","v":0},{"$f":"IF(Q24<=('0 Úvod'!$G$19+'0 Úvod'!$J$19-1),SUMPRODUCT(Q89:Q101,Q160:Q172)+Q174,0)","v":0},{"$f":"IF(R24<=('0 Úvod'!$G$19+'0 Úvod'!$J$19-1),SUMPRODUCT(R89:R101,R160:R172)+R174,0)","v":0},{"$f":"IF(S24<=('0 Úvod'!$G$19+'0 Úvod'!$J$19-1),SUMPRODUCT(S89:S101,S160:S172)+S174,0)","v":0}]
[null,null,{"$f":"C22","v":"Celkové provozní náklady"},null,{"$f":"SUM(E26:E28)","v":0},0,0,0,0,0,0,0,0,0,0,0,0,0,0]
[]
[]
[null,"3.3.","Přírůstkové celkové provozní náklady (CZK)",null,{"$f":"E2","v":2016},{"$f":"E32+1","v":2017},2018,2019,2020,2021,2022,2023,2024,2025,2026,2027,2028,2029,2030]
[null,"a",null,"Celkem"]
[null,null,{"$f":"C4","v":"Náklady na údržbu a provoz infrastruktury"},{"$f":"SUM(E34:S34,E41:S41)","v":0},{"$f":"E4-E19","v":0},0,0,0,0,0,0,0,0,0,0,0,0,0,0]
[null,null,{"$f":"C5","v":"Periodické provozní náklady / opravy"},{"$f":"SUM(E35:S35,E42:S42)","v":0},{"$f":"E5-E20","v":0},0,0,0,0,0,0,0,0,0,0,0,0,0,0]
[null,null,{"$f":"C6","v":"Náklady na řízení provozu"},0,{"$f":"E6-E21","v":0},0,0,0,0,0,0,0,0,0,0,0,0,0,0]
[null,null,"Přírůstkové celkové provozní náklady",0,{"$f":"E7-E22","v":0},0,0,0,0,0,0,0,0,0,0,0,0,0,0]
[]
[null,"3.3.","Přírůstkové celkové provozní náklady (CZK)",null,{"$f":"S32+1","v":2031},{"$f":"E39+1","v":2032},2033,2034,2035,2036,2037,2038,2039,2040,2041,2042,2043,2044,2045]
[null,"b",null,null,{"$f":"S33+1","v":1}]
[null,null,{"$f":"C34","v":"Náklady na údržbu a provoz infrastruktury"},null,{"$f":"E11-E26","v":0},0,0,0,0,0,0,0,0,0,0,0,0,0,0]
[null,null,{"$f":"C35","v":"Periodické provozní náklady / opravy"},null,{"$f":"E12-E27","v":0},0,0,0,0,0,0,0,0,0,0,0,0,0,0]
[null,null,{"$f":"C36","v":"Náklady na řízení provozu"},null,{"$f":"E13-E28","v":0},0,0,0,0,0,0,0,0,0,0,0,0,0,0]
[null,null,"Přírůstkové celkové provozní náklady",null,{"$f":"E14-E29","v":0},0,0,0,0,0,0,0,0,0,0,0,0,0,0]
[]
[]
[null,null,"Scénář s projektem (CZK)",{"$f":"D7","v":0}]
[null,null,"Scénář bez projektu (CZK)",{"$f":"D22","v":0}]
[null,null,"Přírůstkové cash-flow (CZK)",{"$f":"D37","v":0}]
[]
[]
[null,"3.4.","Náklady na řízení provozu","Celk. náklady","Hrubá mzda"]
[null,null,"CÚ",2012,2012]
[null,null,"Měrné ohodnocení","CZK/rok","CZK/rok"]
[null,13167,"Dozorčí provozu",700935,515444]
[null,31606,"Výpravčí",469759,343235]
[null,31608,"Dozorčí provozu - vedoucí směny",537552,394011]
[null,41333,"Operátor železniční dopravy",335996,243243]
[null,83135,"Signalista",371990,270199]
[null,83137,"Výhybkář",308844,222345]
[null,83141,"Staniční dozorce",352233,254766]
[null,83142,"Dozorce výhybek",328384,237467]
[null,83143,"Závorář",288974,207450]
[null,83144,"Závorář s prodejem jízdenek",312352,225554]
[null,83145,"Hradlář - hláskař",305523,220391]
[null,83146,"Hradlář - hláskař s prodejem jízdenek",300697,216798]
[null,93398,"Dělník v dopravě - staniční dělník",226581,162461]
[]
[null,"3.5.","Růst nákladů na řízení provozu",null,{"$f":"E32","v":2016},{"$f":"F32","v":2017},2018,2019,2020,2021,2022,2023,2024,2025,2026,2027,2028,2029,2030]
[null,"a",null,"Elasticita"]
[null,null,"Růst reálné mzdy v dopravě",1,0,{"$f":"$D$71*HLOOKUP(F$69,'0 Úvod'!$D$79:$N$81,2,TRUE)","v":2.5000000000000001E-2},{"$f":"$D$71*HLOOKUP(G$69,'0 Úvod'!$D$79:$N$81,2,TRUE)","v":0.03},{"$f":"$D$71*HLOOKUP(H$69,'0 Úvod'!$D$79:$N$81,2,TRUE)","v":0.03},{"$f":"$D$71*HLOOKUP(I$69,'0 Úvod'!$D$79:$N$81,2,TRUE)","v":2.5000000000000001E-2},{"$f":"$D$71*HLOOKUP(J$69,'0 Úvod'!$D$79:$N$81,2,TRUE)","v":2.5000000000000001E-2},{"$f":"$D$71*HLOOKUP(K$69,'0 Úvod'!$D$79:$N$81,2,TRUE)","v":2.5000000000000001E-2},{"$f":"$D$71*HLOOKUP(L$69,'0 Úvod'!$D$79:$N$81,2,TRUE)","v":2.5000000000000001E-2},{"$f":"$D$71*HLOOKUP(M$69,'0 Úvod'!$D$79:$N$81,2,TRUE)","v":2.5000000000000001E-2},{"$f":"$D$71*HLOOKUP(N$69,'0 Úvod'!$D$79:$N$81,2,TRUE)","v":2.5000000000000001E-2},{"$f":"$D$71*HLOOKUP(O$69,'0 Úvod'!$D$79:$N$81,2,TRUE)","v":2.5000000000000001E-2},{"$f":"$D$71*HLOOKUP(P$69,'0 Úvod'!$D$79:$N$81,2,TRUE)","v":2.5000000000000001E-2},{"$f":"$D$71*HLOOKUP(Q$69,'0 Úvod'!$D$79:$N$81,2,TRUE)","v":2.5000000000000001E-2},{"$f":"$D$71*HLOOKUP(R$69,'0 Úvod'!$D$79:$N$81,2,TRUE)","v":2.5000000000000001E-2},{"$f":"$D$71*HLOOKUP(S$69,'0 Úvod'!$D$79:$N$81,2,TRUE)","v":0.02}]
[null,{"$f":"B55","v":13167},"Dozorčí provozu",null,{"$f":"D55*IF('0 Úvod'!$D$19>HLOOKUP('0 Úvod'!$D$19,'0 Úvod'!$J$51:$N$53,1,TRUE),'0 Úvod'!$N$53*(1+0.02)^('0 Úvod'!$D$19-'0 Úvod'!$N$51),HLOOKUP('0 Úvod'!$D$19,'0 Úvod'!$J$51:$N$53,3,TRUE))*IF(E$69>HLOOKUP(E$69,'0 Úvod'!$D$79:$N$81,1,TRUE),HLOOKUP(E$69,'0 Úvod'!$D$79:$N$81,3,TRUE)*(1+HLOOKUP(E$69,'0 Úvod'!$D$79:$N$81,2,TRUE)*$D$71)^(E$69-HLOOKUP(E$69,'0 Úvod'!$D$79:$N$81,1,TRUE)),HLOOKUP(E$69,'0 Úvod'!$D$79:$N$81,3,TRUE))","v":768267.52323124046},{"$f":"E72*(1+F$71)","v":787474.21131202136},{"$f":"F72*(1+G$71)","v":811098.43765138206},835431.39078092354,856317.1755504465,877725.10493920755,899668.23256268771,922159.93837675487,945213.93683617364,968844.28525707789,993065.3923885047,1017892.0271982172,1043339.3278781725,1069422.8110751268,1090811.2672966293]
[null,31606,"Výpravčí",null,{"$f":"D56*IF('0 Úvod'!$D$19>HLOOKUP('0 Úvod'!$D$19,'0 Úvod'!$J$51:$N$53,1,TRUE),'0 Úvod'!$N$53*(1+0.02)^('0 Úvod'!$D$19-'0 Úvod'!$N$51),HLOOKUP('0 Úvod'!$D$19,'0 Úvod'!$J$51:$N$53,3,TRUE))*IF(E$69>HLOOKUP(E$69,'0 Úvod'!$D$79:$N$81,1,TRUE),HLOOKUP(E$69,'0 Úvod'!$D$79:$N$81,3,TRUE)*(1+HLOOKUP(E$69,'0 Úvod'!$D$79:$N$81,2,TRUE)*$D$71)^(E$69-HLOOKUP(E$69,'0 Úvod'!$D$79:$N$81,1,TRUE)),HLOOKUP(E$69,'0 Úvod'!$D$79:$N$81,3,TRUE))","v":514884.52345165279},{"$f":"E73*(1+F$71)","v":527756.63653794408},{"$f":"F73*(1+G$71)","v":543589.33563408244},559897.0157031049,573894.44109568244,588241.80212307442,602947.84717615123,618021.54335555492,633472.08193944371,649308.88398792979,665541.60608762794,682180.14623981854,699234.6498958139,716715.51614320918,731049.8264660734]
[null,31608,"Dozorčí provozu - vedoucí směny",null,{"$f":"D57*IF('0 Úvod'!$D$19>HLOOKUP('0 Úvod'!$D$19,'0 Úvod'!$J$51:$N$53,1,TRUE),'0 Úvod'!$N$53*(1+0.02)^('0 Úvod'!$D$19-'0 Úvod'!$N$51),HLOOKUP('0 Úvod'!$D$19,'0 Úvod'!$J$51:$N$53,3,TRUE))*IF(E$69>HLOOKUP(E$69,'0 Úvod'!$D$79:$N$81,1,TRUE),HLOOKUP(E$69,'0 Úvod'!$D$79:$N$81,3,TRUE)*(1+HLOOKUP(E$69,'0 Úvod'!$D$79:$N$81,2,TRUE)*$D$71)^(E$69-HLOOKUP(E$69,'0 Úvod'!$D$79:$N$81,1,TRUE)),HLOOKUP(E$69,'0 Úvod'!$D$79:$N$81,3,TRUE))","v":589189.78742394049},603919.53210953891,{"$f":"F74*(1+G$71)","v":622037.11807282513},640698.23161500995,656715.68740538519,673133.57959051977,689961.91908028268,707210.96705728967,724891.24123372184,743013.52226456488,761588.86032117892,780628.5818292083,800144.29637493845,820147.90378431184,836550.86185999808]
[null,41333,"Operátor železniční dopravy",null,{"$f":"D58*IF('0 Úvod'!$D$19>HLOOKUP('0 Úvod'!$D$19,'0 Úvod'!$J$51:$N$53,1,TRUE),'0 Úvod'!$N$53*(1+0.02)^('0 Úvod'!$D$19-'0 Úvod'!$N$51),HLOOKUP('0 Úvod'!$D$19,'0 Úvod'!$J$51:$N$53,3,TRUE))*IF(E$69>HLOOKUP(E$69,'0 Úvod'!$D$79:$N$81,1,TRUE),HLOOKUP(E$69,'0 Úvod'!$D$79:$N$81,3,TRUE)*(1+HLOOKUP(E$69,'0 Úvod'!$D$79:$N$81,2,TRUE)*$D$71)^(E$69-HLOOKUP(E$69,'0 Úvod'!$D$79:$N$81,1,TRUE)),HLOOKUP(E$69,'0 Úvod'!$D$79:$N$81,3,TRUE))","v":368272.11472619261},377478.91759434738,{"$f":"F75*(1+G$71)","v":388803.2851221778},400467.38367584313,410479.06826773915,420741.04497443256,431259.57109879336,442041.06037626317,453092.08688566973,464419.38905781147,476029.87378425669,487930.62062886305,500128.88614458457,512632.10829819913,522884.75046416314]
[null,83135,"Signalista",null,{"$f":"D59*IF('0 Úvod'!$D$19>HLOOKUP('0 Úvod'!$D$19,'0 Úvod'!$J$51:$N$53,1,TRUE),'0 Úvod'!$N$53*(1+0.02)^('0 Úvod'!$D$19-'0 Úvod'!$N$51),HLOOKUP('0 Úvod'!$D$19,'0 Úvod'!$J$51:$N$53,3,TRUE))*IF(E$69>HLOOKUP(E$69,'0 Úvod'!$D$79:$N$81,1,TRUE),HLOOKUP(E$69,'0 Úvod'!$D$79:$N$81,3,TRUE)*(1+HLOOKUP(E$69,'0 Úvod'!$D$79:$N$81,2,TRUE)*$D$71)^(E$69-HLOOKUP(E$69,'0 Úvod'!$D$79:$N$81,1,TRUE)),HLOOKUP(E$69,'0 Úvod'!$D$79:$N$81,3,TRUE))","v":407723.73467837833},417916.82804533775,{"$f":"F76*(1+G$71)","v":430454.3328866979},443367.96287329885,454452.16194513126,465813.46599375951,477458.80264360347,489395.27270969353,501630.15452743584,514170.90839062171,527025.18110038724,540200.81062789692,553705.83089359431,567548.47666593408,578899.44619925274]
[null,83137,"Výhybkář",null,{"$f":"D60*IF('0 Úvod'!$D$19>HLOOKUP('0 Úvod'!$D$19,'0 Úvod'!$J$51:$N$53,1,TRUE),'0 Úvod'!$N$53*(1+0.02)^('0 Úvod'!$D$19-'0 Úvod'!$N$51),HLOOKUP('0 Úvod'!$D$19,'0 Úvod'!$J$51:$N$53,3,TRUE))*IF(E$69>HLOOKUP(E$69,'0 Úvod'!$D$79:$N$81,1,TRUE),HLOOKUP(E$69,'0 Úvod'!$D$79:$N$81,3,TRUE)*(1+HLOOKUP(E$69,'0 Úvod'!$D$79:$N$81,2,TRUE)*$D$71)^(E$69-HLOOKUP(E$69,'0 Úvod'!$D$79:$N$81,1,TRUE)),HLOOKUP(E$69,'0 Úvod'!$D$79:$N$81,3,TRUE))","v":338511.86621416995},346974.66286952415,{"$f":"F77*(1+G$71)","v":357383.90275560989},368105.41983827821,377308.05533423513,386740.75671759096,396409.27563553071,406319.50752641895,416477.49521457939,426889.43259494385,437561.66840981739,448500.71012006281,459713.22787306434,471206.05856989091,480630.17974128877]
[null,83141,"Staniční dozorce",null,{"$f":"D61*IF('0 Úvod'!$D$19>HLOOKUP('0 Úvod'!$D$19,'0 Úvod'!$J$51:$N$53,1,TRUE),'0 Úvod'!$N$53*(1+0.02)^('0 Úvod'!$D$19-'0 Úvod'!$N$51),HLOOKUP('0 Úvod'!$D$19,'0 Úvod'!$J$51:$N$53,3,TRUE))*IF(E$69>HLOOKUP(E$69,'0 Úvod'!$D$79:$N$81,1,TRUE),HLOOKUP(E$69,'0 Úvod'!$D$79:$N$81,3,TRUE)*(1+HLOOKUP(E$69,'0 Úvod'!$D$79:$N$81,2,TRUE)*$D$71)^(E$69-HLOOKUP(E$69,'0 Úvod'!$D$79:$N$81,1,TRUE)),HLOOKUP(E$69,'0 Úvod'!$D$79:$N$81,3,TRUE))","v":386068.85732672719},395720.57875989535,{"$f":"F78*(1+G$71)","v":407592.1961226922},419819.96200637298,430315.46105653228,441073.34758294554,452100.18127251917,463402.68580433208,474987.75294944033,486862.44677317631,499034.0079425057,511509.85814106831,524297.60459459492,537405.04470945976,548153.14560364897]
[null,83142,"Dozorce výhybek",null,{"$f":"D62*IF('0 Úvod'!$D$19>HLOOKUP('0 Úvod'!$D$19,'0 Úvod'!$J$51:$N$53,1,TRUE),'0 Úvod'!$N$53*(1+0.02)^('0 Úvod'!$D$19-'0 Úvod'!$N$51),HLOOKUP('0 Úvod'!$D$19,'0 Úvod'!$J$51:$N$53,3,TRUE))*IF(E$69>HLOOKUP(E$69,'0 Úvod'!$D$79:$N$81,1,TRUE),HLOOKUP(E$69,'0 Úvod'!$D$79:$N$81,3,TRUE)*(1+HLOOKUP(E$69,'0 Úvod'!$D$79:$N$81,2,TRUE)*$D$71)^(E$69-HLOOKUP(E$69,'0 Úvod'!$D$79:$N$81,1,TRUE)),HLOOKUP(E$69,'0 Úvod'!$D$79:$N$81,3,TRUE))","v":359928.89832690282},368927.12078507536,{"$f":"F79*(1+G$71)","v":379994.93440862763},391394.78244088648,401179.65200190863,411209.1433019563,421489.37188450515,432026.60618161777,442827.27133615816,453897.95311956207,465245.40194755106,476876.5369962398,488798.45042114577,501018.41168167436,511038.77991530788]
[null,83143,"Závorář",null,{"$f":"D63*IF('0 Úvod'!$D$19>HLOOKUP('0 Úvod'!$D$19,'0 Úvod'!$J$51:$N$53,1,TRUE),'0 Úvod'!$N$53*(1+0.02)^('0 Úvod'!$D$19-'0 Úvod'!$N$51),HLOOKUP('0 Úvod'!$D$19,'0 Úvod'!$J$51:$N$53,3,TRUE))*IF(E$69>HLOOKUP(E$69,'0 Úvod'!$D$79:$N$81,1,TRUE),HLOOKUP(E$69,'0 Úvod'!$D$79:$N$81,3,TRUE)*(1+HLOOKUP(E$69,'0 Úvod'!$D$79:$N$81,2,TRUE)*$D$71)^(E$69-HLOOKUP(E$69,'0 Úvod'!$D$79:$N$81,1,TRUE)),HLOOKUP(E$69,'0 Úvod'!$D$79:$N$81,3,TRUE))","v":316733.1339685198},324651.46231773274,{"$f":"F80*(1+G$71)","v":334391.00618726475},344422.73637288267,353033.30478220474,361859.1374017598,370905.61583680374,380178.25623272383,389682.71263854188,399424.78045450541,409410.39996586798,419645.65996501467,430136.80146414001,440890.22150074347,449708.02593075833]
[null,83144,"Závorář s prodejem jízdenek",null,{"$f":"D64*IF('0 Úvod'!$D$19>HLOOKUP('0 Úvod'!$D$19,'0 Úvod'!$J$51:$N$53,1,TRUE),'0 Úvod'!$N$53*(1+0.02)^('0 Úvod'!$D$19-'0 Úvod'!$N$51),HLOOKUP('0 Úvod'!$D$19,'0 Úvod'!$J$51:$N$53,3,TRUE))*IF(E$69>HLOOKUP(E$69,'0 Úvod'!$D$79:$N$81,1,TRUE),HLOOKUP(E$69,'0 Úvod'!$D$79:$N$81,3,TRUE)*(1+HLOOKUP(E$69,'0 Úvod'!$D$79:$N$81,2,TRUE)*$D$71)^(E$69-HLOOKUP(E$69,'0 Úvod'!$D$79:$N$81,1,TRUE)),HLOOKUP(E$69,'0 Úvod'!$D$79:$N$81,3,TRUE))","v":342356.84823318053},350915.76943901001,{"$f":"F81*(1+G$71)","v":361443.24252218031},372286.5397978457,381593.70329279179,391133.54587511154,400911.88452198927,410934.68163503899,421208.04867591494,431738.24989281275,442531.70614013303,453594.99879363633,464934.8737634772,476558.24560756411,486089.4105197154]
[null,83145,"Hradlář - hláskař",null,{"$f":"D65*IF('0 Úvod'!$D$19>HLOOKUP('0 Úvod'!$D$19,'0 Úvod'!$J$51:$N$53,1,TRUE),'0 Úvod'!$N$53*(1+0.02)^('0 Úvod'!$D$19-'0 Úvod'!$N$51),HLOOKUP('0 Úvod'!$D$19,'0 Úvod'!$J$51:$N$53,3,TRUE))*IF(E$69>HLOOKUP(E$69,'0 Úvod'!$D$79:$N$81,1,TRUE),HLOOKUP(E$69,'0 Úvod'!$D$79:$N$81,3,TRUE)*(1+HLOOKUP(E$69,'0 Úvod'!$D$79:$N$81,2,TRUE)*$D$71)^(E$69-HLOOKUP(E$69,'0 Úvod'!$D$79:$N$81,1,TRUE)),HLOOKUP(E$69,'0 Úvod'!$D$79:$N$81,3,TRUE))","v":334871.84760381241},343243.64379390772,{"$f":"F82*(1+G$71)","v":353540.95310772496},364147.18170095672,373250.86124348058,382582.13277456758,392146.68609393173,401950.35324627999,411999.11207743693,422299.0898793728,432856.56712635705,443677.98130451597,454769.93083712884,466139.179108057,475461.96269021812]
[null,83146,"Hradlář - hláskař s prodejem jízdenek",null,{"$f":"D66*IF('0 Úvod'!$D$19>HLOOKUP('0 Úvod'!$D$19,'0 Úvod'!$J$51:$N$53,1,TRUE),'0 Úvod'!$N$53*(1+0.02)^('0 Úvod'!$D$19-'0 Úvod'!$N$51),HLOOKUP('0 Úvod'!$D$19,'0 Úvod'!$J$51:$N$53,3,TRUE))*IF(E$69>HLOOKUP(E$69,'0 Úvod'!$D$79:$N$81,1,TRUE),HLOOKUP(E$69,'0 Úvod'!$D$79:$N$81,3,TRUE)*(1+HLOOKUP(E$69,'0 Úvod'!$D$79:$N$81,2,TRUE)*$D$71)^(E$69-HLOOKUP(E$69,'0 Úvod'!$D$79:$N$81,1,TRUE)),HLOOKUP(E$69,'0 Úvod'!$D$79:$N$81,3,TRUE))","v":329582.25717515073},337821.81360452948,{"$f":"F83*(1+G$71)","v":347956.4680126654},358395.16205304535,367355.04110437143,376538.91713198071,385952.39006028022,395601.19981178717,405491.22980708181,415628.51055225881,426019.22331606527,436669.70389896684,447586.44649644097,458776.10765885195,467951.62981202902]
[null,93398,"Dělník v dopravě - staniční dělník",null,{"$f":"D67*IF('0 Úvod'!$D$19>HLOOKUP('0 Úvod'!$D$19,'0 Úvod'!$J$51:$N$53,1,TRUE),'0 Úvod'!$N$53*(1+0.02)^('0 Úvod'!$D$19-'0 Úvod'!$N$51),HLOOKUP('0 Úvod'!$D$19,'0 Úvod'!$J$51:$N$53,3,TRUE))*IF(E$69>HLOOKUP(E$69,'0 Úvod'!$D$79:$N$81,1,TRUE),HLOOKUP(E$69,'0 Úvod'!$D$79:$N$81,3,TRUE)*(1+HLOOKUP(E$69,'0 Úvod'!$D$79:$N$81,2,TRUE)*$D$71)^(E$69-HLOOKUP(E$69,'0 Úvod'!$D$79:$N$81,1,TRUE)),HLOOKUP(E$69,'0 Úvod'!$D$79:$N$81,3,TRUE))","v":248346.59944396795},254555.26443006712,{"$f":"F84*(1+G$71)","v":262191.92236296914},270057.68003385823,276809.12203470466,283729.35008557228,290822.58383771154,298093.14843365428,305545.47714449558,313184.11407310795,321013.71692493564,329039.05984805903,337265.0363442605,345696.66225286701,352610.59549792437]
[]
[null,{"$f":"B69","v":"3.5."},{"$f":"C69","v":"Růst nákladů na řízení provozu"},null,{"$f":"E39","v":2031},2032,2033,2034,2035,2036,2037,2038,2039,2040,2041,2042,2043,2044,2045]
[null,"b",null,"Elasticita"]
[null,null,{"$f":"C71","v":"Růst reálné mzdy v dopravě"},{"$f":"D71","v":1},{"$f":"$D$71*HLOOKUP(E$86,'0 Úvod'!$D$79:$N$81,2,TRUE)","v":0.02},{"$f":"$D$71*HLOOKUP(F$86,'0 Úvod'!$D$79:$N$81,2,TRUE)","v":0.02},{"$f":"$D$71*HLOOKUP(G$86,'0 Úvod'!$D$79:$N$81,2,TRUE)","v":0.02},{"$f":"$D$71*HLOOKUP(H$86,'0 Úvod'!$D$79:$N$81,2,TRUE)","v":0.02},{"$f":"$D$71*HLOOKUP(I$86,'0 Úvod'!$D$79:$N$81,2,TRUE)","v":0.02},{"$f":"$D$71*HLOOKUP(J$86,'0 Úvod'!$D$79:$N$81,2,TRUE)","v":0.02},{"$f":"$D$71*HLOOKUP(K$86,'0 Úvod'!$D$79:$N$81,2,TRUE)","v":0.02},{"$f":"$D$71*HLOOKUP(L$86,'0 Úvod'!$D$79:$N$81,2,TRUE)","v":0.02},{"$f":"$D$71*HLOOKUP(M$86,'0 Úvod'!$D$79:$N$81,2,TRUE)","v":0.02},{"$f":"$D$71*HLOOKUP(N$86,'0 Úvod'!$D$79:$N$81,2,TRUE)","v":0.02},{"$f":"$D$71*HLOOKUP(O$86,'0 Úvod'!$D$79:$N$81,2,TRUE)","v":0.02},{"$f":"$D$71*HLOOKUP(P$86,'0 Úvod'!$D$79:$N$81,2,TRUE)","v":0.02},{"$f":"$D$71*HLOOKUP(Q$86,'0 Úvod'!$D$79:$N$81,2,TRUE)","v":0.02},{"$f":"$D$71*HLOOKUP(R$86,'0 Úvod'!$D$79:$N$81,2,TRUE)","v":0.02},{"$f":"$D$71*HLOOKUP(S$86,'0 Úvod'!$D$79:$N$81,2,TRUE)","v":0.02}]
[null,{"$f":"B72","v":13167},"Dozorčí provozu",null,{"$f":"S72*(1+E$88)","v":1112627.4926425619},{"$f":"E89*(1+F$88)","v":1134880.0424954132},{"$f":"F89*(1+G$88)","v":1157577.6433453215},1180729.1962122279,1204343.7801364725,1228430.6557392019,1252999.2688539859,1278059.2542310657,1303620.4393156872,1329692.848102001,1356286.7050640411,1383412.4391653219,1411080.6879486283,1439302.3017076009,1468088.3477417531]
[null,31606,"Výpravčí",null,{"$f":"S73*(1+E$88)","v":745670.82299539493},{"$f":"E90*(1+F$88)","v":760584.23945530283},{"$f":"F90*(1+G$88)","v":775795.92424440884},791311.842729297,807138.07958388294,823280.84117556061,839746.4579990718,856541.38715905324,873672.21490223426,891145.65920027893,908968.57238428458,927147.94383197033,945690.9027086097,964604.72076278192,983896.81517803762]
[null,31608,"Dozorčí provozu - vedoucí směny",null,853281.87909719802,870347.51667914202,{"$f":"F91*(1+G$88)","v":887754.46701272484},905509.55635297939,923619.74748003902,942092.14242963982,960933.98527823261,980152.66498379724,999755.71828347316,1019750.8326491426,1040145.8493021255,1060948.766288168,1082167.7416139315,1103811.0964462101,1125887.3183751344]
[null,41333,"Operátor železniční dopravy",null,533342.44547344639,544009.29438291537,{"$f":"F92*(1+G$88)","v":554889.48027057364},565987.2698759851,577307.01527350477,588853.15557897487,600630.21869055438,612642.82306436542,624895.67952565278,637393.59311616584,650141.46497848921,663144.29427805904,676407.18016362027,689935.32376689266,703734.03024223051]
[null,83135,"Signalista",null,590477.43512323778,602286.98382570257,{"$f":"F93*(1+G$88)","v":614332.72350221663},626619.37797226093,639151.76553170616,651934.80084234034,664973.49685918714,678272.96679637092,691838.42613229831,705675.19465494424,719788.69854804315,734184.47251900402,748868.16196938406,763845.52520877181,779122.43571294728]
[null,83137,"Výhybkář",null,490242.78333611455,500047.63900283683,{"$f":"F94*(1+G$88)","v":510048.59178289358},520249.56361855147,530654.5548909225,541267.64598874096,552092.99890851579,563134.85888668615,574397.55606441991,585885.50718570827,597603.21732942248,609555.28167601093,621746.3873095311,634181.31505572179,646864.94135683624]
[null,83141,"Staniční dozorce",null,559116.20851572196,570298.53268603643,{"$f":"F95*(1+G$88)","v":581704.50333975721},593338.59340655233,605205.36527468334,617309.47258017701,629655.66203178058,642248.77527241618,655093.75077786448,668195.62579342176,681559.53830929019,695190.72907547606,709094.54365698562,723276.43453012535,737741.96322072786]
[null,83142,"Dozorce výhybek",null,521259.55551361403,531684.74662388628,{"$f":"F96*(1+G$88)","v":542318.44155636407},553164.81038749136,564228.10659524123,575512.66872714611,587022.92210168904,598763.38054372277,610738.64815459726,622953.42111768923,635412.48954004305,648120.73933084391,661083.15411746083,674304.81719981006,687790.91354380629]
[null,83143,"Závorář",null,458702.18644937349,467876.23017836094,{"$f":"F97*(1+G$88)","v":477233.75478192815},486778.4298775667,496513.99847511802,506444.27844462037,516573.16401351278,526904.62729378301,537442.7198396587,548191.57423645188,559155.40572118096,570338.51383560454,581745.28411231667,593380.18979456299,605247.79359045427]
[null,83144,"Závorář s prodejem jízdenek",null,495811.19873010973,505727.42270471191,{"$f":"F98*(1+G$88)","v":515841.97115880618},526158.81058198225,536681.98679362191,547415.6265294943,558363.93906008417,569531.21784128586,580921.84219811158,592540.27904207387,604391.08462291537,616478.90631537372,628808.48444168118,641384.65413051483,654212.34721312509]
[null,83145,"Hradlář - hláskař",null,484971.2019440225,494670.62598290294,{"$f":"F99*(1+G$88)","v":504564.03850256099},514655.31927261222,524948.42565806443,535447.39417122572,546156.3420546503,557079.46889574337,568221.05827365827,579585.47943913145,591177.18902791408,603000.73280847236,615060.74746464181,627361.96241393464,639909.20166221331]
[null,83146,"Hradlář - hláskař s prodejem jízdenek",null,477310.66240826959,486856.87565643498,{"$f":"F100*(1+G$88)","v":496594.01316956367},506525.89343295497,516656.41130161408,526989.53952764638,537529.33031819935,548279.91692456335,559245.51526305464,570430.42556831578,581839.03407968208,593475.81476127577,605345.33105650125,617452.23767763132,629801.28243118396]
[null,93398,"Dělník v dopravě - staniční dělník",null,359662.80740788288,366856.06355604052,{"$f":"F101*(1+G$88)","v":374193.18482716131},381677.04852370452,389310.5894941786,397096.80128406215,405038.73730974342,413139.51205593831,421402.30229705706,429830.34834299819,438426.95530985814,447195.49441605533,456139.40430437645,465262.19239046401,474567.43623827328]
[]
[]
[null,"3.6.","Počty zaměstnanců",null,{"$f":"E69","v":2016},2017,2018,2019,2020,2021,2022,2023,2024,2025,2026,2027,2028,2029,2030]
[null,"a","Scénář s projektem"]
[null,{"$f":"B89","v":13167},"Dozorčí provozu"]
[null,31606,"Výpravčí"]
[null,31608,"Dozorčí provozu - vedoucí směny"]
[null,41333,"Operátor železniční dopravy"]
[null,83135,"Signalista"]
[null,83137,"Výhybkář"]
[null,83141,"Staniční dozorce"]
[null,83142,"Dozorce výhybek"]
[null,83143,"Závorář"]
[null,83144,"Závorář s prodejem jízdenek"]
[null,83145,"Hradlář - hláskař"]
[null,83146,"Hradlář - hláskař s prodejem jízdenek"]
[null,93398,"Dělník v dopravě - staniční dělník"]
[null,null,"Celkem",null,{"$f":"SUM(E106:E118)","v":0},0,0,0,0,0,0,0,0,0,0,0,0,0,0]
[null,null,"Odstupné",null,{"$f":"SUMPRODUCT($E$55:$E$67*(E$72/$D$55)/4,E106:E118-F106:F118)","v":0},{"$f":"SUMPRODUCT($E$55:$E$67*(F$72/$D$55)/4,F106:F118-G106:G118)","v":0},0,0,0,0,0,0,0,0,{"$f":"SUMPRODUCT($E$55:$E$67*(O$72/$D$55)/4,O106:O118-P106:P118)","v":0},0,0,0,{"$f":"SUMPRODUCT($E$55:$E$67*(S$72/$D$55)/4,S106:S118-E124:E136)","v":0}]
[]
[null,{"$f":"B104","v":"3.6."},{"$f":"C104","v":"Počty zaměstnanců"},null,{"$f":"E86","v":2031},2032,2033,2034,2035,2036,2037,2038,2039,2040,2041,2042,2043,2044,2045]
[null,"b","Scénář s projektem"]
[null,{"$f":"B106","v":13167},"Dozorčí provozu"]
[null,31606,"Výpravčí"]
[null,31608,"Dozorčí provozu - vedoucí směny"]
[null,41333,"Operátor železniční dopravy"]
[null,83135,"Signalista"]
[null,83137,"Výhybkář"]
[null,83141,"Staniční dozorce"]
[null,83142,"Dozorce výhybek"]
[null,83143,"Závorář"]
[null,83144,"Závorář s prodejem jízdenek"]
[null,83145,"Hradlář - hláskař"]
[null,83146,"Hradlář - hláskař s prodejem jízdenek"]
[null,93398,"Dělník v dopravě - staniční dělník"]
[null,null,"Celkem",null,{"$f":"SUM(E124:E136)","v":0},{"$f":"SUM(F124:F136)","v":0},0,0,0,0,0,0,0,0,0,0,0,0,0]
[null,null,"Odstupné",null,{"$f":"SUMPRODUCT($E$55:$E$67*(E$89/$D$55)/4,E124:E136-F124:F136)","v":0},{"$f":"SUMPRODUCT($E$55:$E$67*(F$89/$D$55)/4,F124:F136-G124:G136)","v":0},0,0,0,0,0,0,0,0,0,0,0,0,0]
[]
[null,"3.7.",{"$f":"C122","v":"Počty zaměstnanců"},null,{"$f":"E104","v":2016},2017,2018,2019,2020,2021,2022,2023,2024,2025,2026,2027,2028,2029,2030]
[null,"a","Scénář bez projektu"]
[null,{"$f":"B124","v":13167},"Dozorčí provozu"]
[null,31606,"Výpravčí"]
[null,31608,"Dozorčí provozu - vedoucí směny"]
[null,41333,"Operátor železniční dopravy"]
[null,83135,"Signalista"]
[null,83137,"Výhybkář"]
[null,83141,"Staniční dozorce"]
[null,83142,"Dozorce výhybek"]
[null,83143,"Závorář"]
[null,83144,"Závorář s prodejem jízdenek"]
[null,83145,"Hradlář - hláskař"]
[null,83146,"Hradlář - hláskař s prodejem jízdenek"]
[null,93398,"Dělník v dopravě - staniční dělník"]
[null,null,"Celkem",null,{"$f":"SUM(E142:E154)","v":0},{"$f":"SUM(F142:F154)","v":0},0,0,0,0,0,0,0,0,0,0,0,0,0]
[null,null,"Odstupné",null,{"$f":"SUMPRODUCT($E$55:$E$67*(E$72/$D$55)/4,E142:E154-F142:F154)","v":0},{"$f":"SUMPRODUCT($E$55:$E$67*(F$72/$D$55)/4,F142:F154-G142:G154)","v":0},0,0,0,0,0,0,0,0,{"$f":"SUMPRODUCT($E$55:$E$67*(O$72/$D$55)/4,O142:O154-P142:P154)","v":0},0,0,0,{"$f":"SUMPRODUCT($E$55:$E$67*(S$72/$D$55)/4,S142:S154-E160:E172)","v":0}]
[]
[null,{"$f":"B140","v":"3.7."},{"$f":"C122","v":"Počty zaměstnanců"},null,{"$f":"E122","v":2031},2032,2033,2034,2035,2036,2037,2038,2039,2040,2041,2042,2043,2044,2045]
[null,"b","Scénář bez projektu",null,1,2,3,4,5,6,7,8,9,10,11,12,13,14,15]
[null,{"$f":"B142","v":13167},"Dozorčí provozu"]
[null,31606,"Výpravčí"]
[null,31608,"Dozorčí provozu - vedoucí směny"]
[null,41333,"Operátor železniční dopravy"]
[null,83135,"Signalista"]
[null,83137,"Výhybkář"]
[null,83141,"Staniční dozorce"]
[null,83142,"Dozorce výhybek"]
[null,83143,"Závorář"]
[null,83144,"Závorář s prodejem jízdenek"]
[null,83145,"Hradlář - hláskař"]
[null,83146,"Hradlář - hláskař s prodejem jízdenek"]
[null,93398,"Dělník v dopravě - staniční dělník"]
[null,null,"Celkem",null,{"$f":"SUM(E160:E172)","v":0},{"$f":"SUM(F160:F172)","v":0},0,0,0,0,0,0,0,0,0,0,0,0,0]
[null,null,"Odstupné",null,{"$f":"SUMPRODUCT($E$55:$E$67*(E$89/$D$55)/4,E160:E172-F160:F172)","v":0},{"$f":"SUMPRODUCT($E$55:$E$67*(F$89/$D$55)/4,F160:F172-G160:G172)","v":0},0,0,0,0,0,0,0,0,0,0,0,0,0]
[]
[]
[null,"Komentáře"]
[]
[null,"V tabulkách 3.1 a 3.2 zpracovatel přímo dopočítává a vyplňuje pouze provozní náklady na údržbu a opravy infrastruktury."]
[null,"Pro vyčíslení provozních nákladů na řízení dopravy se využije přednastavených vzorců v tabulkách 3.1, 3.2 a 3.5. Zpracovatel vyplňuje pouze tabulky 3.6 a 3.7 a ověřuje správnost výpočtu odstupného."]

{"sheet":"4 Tržby","index":4,"n_rows":126,"n_cols":19,"rows_kept":126,"cut":false,"hidden":false,"merged":[[91,8,92,8],[91,10,92,10],[91,16,92,16],[91,17,92,17],[91,18,92,18],[123,1,124,15],[107,15,108,15],[107,4,108,4],[107,5,108,5],[107,6,108,6],[107,7,108,7],[107,13,108,13],[107,14,108,14],[91,9,92,9],[91,13,92,13],[107,12,108,12],[91,4,92,4],[91,5,92,5],[91,6,92,6],[91,7,92,7],[107,8,108,8],[107,9,108,9],[107,10,108,10],[74,13,75,13],[58,15,59,15],[58,16,59,16],[58,12,59,12],[74,11,75,11],[74,12,75,12],[58,14,59,14],[107,16,108,16],[107,18,108,18],[107,11,108,11],[91,14,92,14],[91,15,92,15],[91,11,92,11],[91,12,92,12],[74,14,75,14],[74,15,75,15],[74,4,75,4],[74,5,75,5],[74,6,75,6],[74,7,75,7],[74,8,75,8],[58,9,59,9],[58,8,59,8],[58,10,59,10],[58,11,59,11],[74,9,75,9],[74,10,75,10],[38,10,39,10],[31,13,32,13],[31,12,32,12],[31,8,32,8],[31,9,32,9],[38,9,39,9],[31,10,32,10],[31,11,32,11],[58,13,59,13],[51,7,51,9],[38,4,39,4],[38,5,39,5],[38,6,39,6],[38,7,39,7],[38,8,39,8],[58,4,59,4],[58,5,59,5],[58,6,59,6],[58,7,59,7],[51,4,51,6],[31,15,32,15],[31,16,32,16],[31,14,32,14],[38,17,39,17],[38,18,39,18],[38,11,39,11],[38,12,39,12],[38,13,39,13],[38,14,39,14],[38,15,39,15],[38,16,39,16],[31,4,32,4],[31,5,32,5],[31,6,32,6],[31,7,32,7],[23,4,24,4],[23,5,24,5],[16,18,17,18],[23,16,24,16],[23,17,24,17],[23,18,24,18],[23,12,24,12],[16,16,17,16],[23,14,24,14],[16,17,17,17],[16,14,17,14],[23,9,24,9],[23,6,24,6],[23,7,24,7],[23,10,24,10],[23,11,24,11],[23,8,24,8],[31,18,32,18],[23,13,24,13],[23,15,24,15],[16,4,17,4],[16,5,17,5],[16,6,17,6],[16,7,17,7],[8,11,9,11],[8,12,9,12],[16,15,17,15],[16,11,17,11],[16,8,17,8],[16,9,17,9],[16,12,17,12],[16,13,17,13],[16,10,17,10],[8,15,9,15],[8,4,9,4],[8,5,9,5],[8,6,9,6],[8,7,9,7],[1,15,2,15],[8,17,9,17],[8,14,9,14],[8,8,9,8],[8,9,9,9],[1,12,2,12],[1,13,2,13],[8,10,9,10],[8,13,9,13],[1,10,2,10],[1,11,2,11],[1,4,2,4],[1,5,2,5],[1,6,2,6],[1,7,2,7],[1,8,2,8],[1,9,2,9],[1,14,2,14],[58,28,59,28],[74,19,75,19],[74,20,75,20],[74,21,75,21],[74,22,75,22],[74,23,75,23],[74,24,75,24],[74,25,75,25],[74,26,75,26],[58,19,59,19],[58,20,59,20],[58,21,59,21],[58,22,59,22],[58,23,59,23],[58,24,59,24],[58,25,59,25],[58,26,59,26],[58,27,59,27],[8,18,9,18],[1,18,2,18],[8,16,9,16],[1,16,2,16],[1,17,2,17],[107,19,108,19],[107,20,108,20],[107,21,108,21],[107,22,108,22],[74,27,75,27],[31,17,32,17],[74,16,75,16],[58,18,59,18],[74,17,75,17],[107,17,108,17],[74,18,75,18],[58,17,59,17],[74,28,75,28],[91,19,92,19],[91,20,92,20],[91,21,92,21],[91,22,92,22],[91,23,92,23],[91,24,92,24],[107,27,108,27],[107,28,108,28],[91,25,92,25],[91,26,92,26],[91,27,92,27],[91,28,92,28],[107,23,108,23],[107,24,108,24],[107,25,108,25],[107,26,108,26]]}
[]
[null,"4.1.","Celkové provozní příjmy (CZK)",null,{"$f":"'0 Úvod'!G19","v":2016},{"$f":"E2+1","v":2017},2018,2019,2020,2021,2022,2023,2024,2025,2026,2027,2028,2029,2030]
[null,"a","Scénář s projektem","Celkem"]
[null,null,"Příjmy z poplatků za dopravní cestu - osobní doprava",{"$f":"SUM(E4:S4,E11:S11)","v":0},{"$f":"E61*$E$54+E62*$F$54+E63*$G$54+(E64*$E$55+E65*$F$55+E66*$G$55)/1000","v":0},{"$f":"F61*$E$54+F62*$F$54+F63*$G$54+(F64*$E$55+F65*$F$55+F66*$G$55)/1000","v":0},0,0,0,0,0,0,0,0,0,0,0,0,0]
[null,null,"Příjmy z poplatků za dopravní cestu - nákladní doprava",{"$f":"SUM(E5:S5,E12:S12)","v":0},{"$f":"$H$54*E67+$I$54*E68+$J$54*E69+($H$55*E70+$I$55*E71+$J$55*E72)/1000","v":0},{"$f":"$H$54*F67+$I$54*F68+$J$54*F69+($H$55*F70+$I$55*F71+$J$55*F72)/1000","v":0},0,0,0,0,0,0,0,0,0,0,0,0,0]
[null,null,"Ostatní příjmy",{"$f":"SUM(E6:S6,E13:S13)","v":0}]
[null,null,"Celkové provozní příjmy (CZK)",{"$f":"SUM(E7:S7,E14:S14)","v":0},{"$f":"SUM(E4:E6)","v":0},{"$f":"SUM(F4:F6)","v":0},0,{"$f":"SUM(H4:H6)","v":0},0,0,0,0,0,0,0,0,0,0,0]
[]
[null,"4.1.","Celkové provozní příjmy (CZK)",null,{"$f":"S2+1","v":2031},{"$f":"E9+1","v":2032},2033,2034,2035,2036,2037,2038,2039,2040,2041,2042,2043,2044,2045]
[null,"b","Scénář s projektem"]
[null,null,"Příjmy z poplatků za dopravní cestu - osobní doprava",null,{"$f":"E77*$E$54+E78*$F$54+E79*$G$54+(E80*$E$55+E81*$F$55+E82*$G$55)/1000","v":0},{"$f":"F77*$E$54+F78*$F$54+F79*$G$54+(F80*$E$55+F81*$F$55+F82*$G$55)/1000","v":0},0,0,0,0,0,0,0,0,0,0,0,0,0]
[null,null,"Příjmy z poplatků za dopravní cestu - nákladní doprava",null,{"$f":"$H$54*E83+$I$54*E84+$J$54*E85+($H$55*E86+$I$55*E87+$J$55*E88)/1000","v":0},{"$f":"$H$54*F83+$I$54*F84+$J$54*F85+($H$55*F86+$I$55*F87+$J$55*F88)/1000","v":0},0,0,0,0,0,0,0,0,0,0,0,0,0]
[null,null,"Ostatní příjmy"]
[null,null,"Celkové provozní příjmy (CZK)",null,{"$f":"SUM(E11:E13)","v":0},0,0,0,0,0,0,0,0,0,0,0,0,0,0]
[]
[]
[null,"4.2.","Celkové provozní příjmy (CZK)",null,{"$f":"E2","v":2016},{"$f":"E17+1","v":2017},2018,2019,2020,2021,2022,2023,2024,2025,2026,2027,2028,2029,2030]
[null,"a","Scénář bez projektu","Celkem"]
[null,null,"Příjmy z poplatků za dopravní cestu - osobní doprava",{"$f":"SUM(E19:S19,E26:S26)","v":0},{"$f":"E94*$E$54+E95*$F$54+E96*$G$54+(E97*$E$55+E98*$F$55+E99*$G$55)/1000","v":0},{"$f":"F94*$E$54+F95*$F$54+F96*$G$54+(F97*$E$55+F98*$F$55+F99*$G$55)/1000","v":0},0,0,0,0,0,0,0,0,0,0,0,0,0]
[null,null,"Příjmy z poplatků za dopravní cestu - nákladní doprava",{"$f":"SUM(E20:S20,E27:S27)","v":0},{"$f":"$H$54*E100+$I$54*E101+$J$54*E102+($H$55*E103+$I$55*E104+$J$55*E105)/1000","v":0},{"$f":"$H$54*F100+$I$54*F101+$J$54*F102+($H$55*F103+$I$55*F104+$J$55*F105)/1000","v":0},0,0,0,0,0,0,0,0,0,0,0,0,0]
[null,null,"Ostatní příjmy",{"$f":"SUM(E21:S21,E28:S28)","v":0}]
[null,null,"Celkové provozní příjmy (CZK)",{"$f":"SUM(E22:S22,E29:S29)","v":0},{"$f":"SUM(E19:E21)","v":0},0,0,0,0,0,0,0,0,0,0,0,0,0,0]
[]
[null,"4.2.","Celkové provozní příjmy (CZK)",null,{"$f":"S17+1","v":2031},{"$f":"E24+1","v":2032},2033,2034,2035,2036,2037,2038,2039,2040,2041,2042,2043,2044,2045]
[null,"b","Scénář bez projektu"]
[null,null,"Příjmy z poplatků za dopravní cestu - osobní doprava",null,{"$f":"E110*$E$54+E111*$F$54+E112*$G$54+(E113*$E$55+E114*$F$55+E115*$G$55)/1000","v":0},{"$f":"F110*$E$54+F111*$F$54+F112*$G$54+(F113*$E$55+F114*$F$55+F115*$G$55)/1000","v":0},0,0,0,0,0,0,0,0,0,0,0,0,0]
[null,null,"Příjmy z poplatků za dopravní cestu - nákladní doprava",null,{"$f":"$H$54*E116+$I$54*E117+$J$54*E118+($H$55*E119+$I$55*E120+$J$55*E121)/1000","v":0},{"$f":"$H$54*F116+$I$54*F117+$J$54*F118+($H$55*F119+$I$55*F120+$J$55*F121)/1000","v":0},0,0,0,0,0,0,0,0,0,0,0,0,0]
[null,null,"Ostatní příjmy"]
[null,null,"Celkové provozní příjmy (CZK)",null,{"$f":"SUM(E26:E28)","v":0},0,0,0,0,0,0,0,0,0,0,0,0,0,0]
[]
[]
[null,"4.3.","Celkové přírůstkové provozní příjmy (CZK)",null,{"$f":"E2","v":2016},{"$f":"E32+1","v":2017},2018,2019,2020,2021,2022,2023,2024,2025,2026,2027,2028,2029,2030]
[null,"a","Přírůstek cash-flow","Celkem"]
[null,null,"Příjmy z poplatků za dopravní cestu - osobní doprava",{"$f":"SUM(E34:S34,E41:S41)","v":0},{"$f":"E4-E19","v":0},{"$f":"F4-F19","v":0},0,0,0,0,0,0,0,0,0,0,0,0,0]
[null,null,"Příjmy z poplatků za dopravní cestu - nákladní doprava",{"$f":"SUM(E35:S35,E42:S42)","v":0},{"$f":"E5-E20","v":0},{"$f":"F5-F20","v":0},0,0,0,0,0,0,0,0,0,0,0,0,0]
[null,null,"Ostatní příjmy",{"$f":"SUM(E36:S36,E43:S43)","v":0},{"$f":"E6-E21","v":0},{"$f":"F6-F21","v":0},0,0,0,0,0,0,0,0,0,0,0,0,0]
[null,null,"Celkové přírůstkové provozní příjmy (CZK)",{"$f":"SUM(E37:S37,E44:S44)","v":0},{"$f":"E7-E22","v":0},{"$f":"F7-F22","v":0},0,0,0,0,0,0,0,0,0,0,0,0,0]
[]
[null,"4.3.","Celkové přírůstkové provozní příjmy (CZK)",null,{"$f":"S32+1","v":2031},{"$f":"E39+1","v":2032},2033,2034,2035,2036,2037,2038,2039,2040,2041,2042,2043,2044,2045]
[null,"b","Přírůstek cash-flow"]
[null,null,"Příjmy z poplatků za dopravní cestu - osobní doprava",null,{"$f":"E11-E26","v":0},0,0,0,0,0,0,0,0,0,0,0,0,0,{"$f":"S11-S26","v":0}]
[null,null,"Příjmy z poplatků za dopravní cestu - nákladní doprava",null,0,0,0,0,0,0,0,0,0,0,0,0,0,0,0]
[null,null,"Ostatní příjmy",null,{"$f":"E13-E28","v":0},0,0,0,0,0,0,0,0,0,0,0,0,0,{"$f":"S13-S28","v":0}]
[null,null,"Celkové přírůstkové provozní příjmy (CZK)",null,{"$f":"E14-E29","v":0},0,0,0,0,0,0,0,0,0,0,0,0,0,{"$f":"S14-S29","v":0}]
[]
[]
[null,null,"Scénář s projektem (CZK)",{"$f":"D7","v":0}]
[null,null,"Scénář bez projektu (CZK)",{"$f":"D22","v":0}]
[null,null,"Přírůstek cash-flow (CZK)",{"$f":"D37","v":0}]
[]
[]
[null,null,null,null,"Osobní",null,null,"Nákladní"]
[null,"4.4.","Příjmy z poplatků za dopravní cestu",null,"TEN-T","celostátní","regionální","TEN-T","celostátní","regionální"]
[null,null,"Poplatek za provozování dopravní cesty ","Kč/vlkm",7.81,6.49,5.5,36.1,35.33,33.19]
[null,null,"Poplatek za zajištění provozuschopnosti DC","Kč/1000 hrtkm",44.77,35.590000000000003,30.16,49.23,43.88,33.6]
[null,null,"Zdroj: „Prohlášení o dráze celostátní a regionální platné pro jízdní řád 2016 a 2017“ (příloha C, část C)"]
[]
[]
[null,"4.5.","Celkové výkony",null,{"$f":"E2","v":2016},{"$f":"E59+1","v":2017},2018,2019,2020,2021,2022,2023,2024,2025,2026,2027,2028,2029,2030]
[null,"a","Scénář s projektem","Celkem"]
[null,"S1E","vlkm - osobní doprava - dráhy TEN-T",{"$f":"SUM(E61:S61,E77:S77)","v":0}]
[null,"S1C","vlkm - osobní doprava - celostátní",{"$f":"SUM(E62:S62,E78:S78)","v":0}]
[null,"S1R","vlkm - osobní doprava - regionální",0]
[null,"S2E","hrtkm - osobní doprava - dráhy TEN-T",0]
[null,"S2C","hrtkm - osobní doprava - celostátní",0]
[null,"S2R","hrtkm - osobní doprava - regionální",0]
[null,"S1E","vlkm - nákladní doprava - dráhy TEN-T",0]
[null,"S1C","vlkm - nákladní doprava - celostátní",0]
[null,"S1R","vlkm - nákladní doprava - regionální",0]
[null,"S2E","hrtkm - nákladní doprava - dráhy TEN-T",0]
[null,"S2C","hrtkm - nákladní doprava - celostátní",0]
[null,"S2R","hrtkm - nákladní doprava - regionální",0]
[]
[]
[null,{"$f":"B59","v":"4.5."},{"$f":"C59","v":"Celkové výkony"},null,{"$f":"S59+1","v":2031},{"$f":"E75+1","v":2032},2033,2034,2035,2036,2037,2038,2039,2040,2041,2042,2043,2044,2045]
[null,"b","Scénář s projektem"]
[null,{"$f":"B61","v":"S1E"},"vlkm - osobní doprava - dráhy TEN-T"]
[null,"S1C","vlkm - osobní doprava - celostátní"]
[null,"S1R","vlkm - osobní doprava - regionální"]
[null,"S2E","hrtkm - osobní doprava - dráhy TEN-T"]
[null,"S2C","hrtkm - osobní doprava - celostátní"]
[null,"S2R","hrtkm - osobní doprava - regionální"]
[null,"S1E","vlkm - nákladní doprava - dráhy TEN-T"]
[null,"S1C","vlkm - nákladní doprava - celostátní"]
[null,"S1R","vlkm - nákladní doprava - regionální"]
[null,"S2E","hrtkm - nákladní doprava - dráhy TEN-T"]
[null,"S2C","hrtkm - nákladní doprava - celostátní"]
[null,"S2R","hrtkm - nákladní doprava - regionální"]
[]
[]
[]
[null,"4.6.","Celkové výkony",null,{"$f":"E59","v":2016},{"$f":"E92+1","v":2017},2018,2019,2020,2021,2022,2023,2024,2025,2026,2027,2028,2029,2030]
[null,"a","Scénář bez projektu","Celkem"]
[null,{"$f":"B77","v":"S1E"},"vlkm - osobní doprava - dráhy TEN-T",{"$f":"SUM(E94:S94,E110:S110)","v":0}]
[null,"S1C","vlkm - osobní doprava - celostátní",{"$f":"SUM(E95:S95,E111:S111)","v":0}]
[null,"S1R","vlkm - osobní doprava - regionální",0]
[null,"S2E","hrtkm - osobní doprava - dráhy TEN-T",0]
[null,"S2C","hrtkm - osobní doprava - celostátní",0]
[null,"S2R","hrtkm - osobní doprava - regionální",0]
[null,"S1E","vlkm - nákladní doprava - dráhy TEN-T",0]
[null,"S1C","vlkm - nákladní doprava - celostátní",0]
[null,"S1R","vlkm - nákladní doprava - regionální",0]
[null,"S2E","hrtkm - nákladní doprava - dráhy TEN-T",0]
[null,"S2C","hrtkm - nákladní doprava - celostátní",0]
[null,"S2R","hrtkm - nákladní doprava - regionální",0]
[]
[]
[null,{"$f":"B92","v":"4.6."},{"$f":"C92","v":"Celkové výkony"},null,{"$f":"S92+1","v":2031},{"$f":"E108+1","v":2032},2033,2034,2035,2036,2037,2038,2039,2040,2041,2042,2043,2044,2045]
[null,"b","Scénář bez projektu"]
[null,{"$f":"B94","v":"S1E"},"vlkm - osobní doprava - dráhy TEN-T"]
[null,"S1C","vlkm - osobní doprava - celostátní"]
[null,"S1R","vlkm - osobní doprava - regionální"]
[null,"S2E","hrtkm - osobní doprava - dráhy TEN-T"]
[null,"S2C","hrtkm - osobní doprava - celostátní"]
[null,"S2R","hrtkm - osobní doprava - regionální"]
[null,"S1E","vlkm - nákladní doprava - dráhy TEN-T"]
[null,"S1C","vlkm - nákladní doprava - celostátní"]
[null,"S1R","vlkm - nákladní doprava - regionální"]
[null,"S2E","hrtkm - nákladní doprava - dráhy TEN-T"]
[null,"S2C","hrtkm - nákladní doprava - celostátní"]
[null,"S2R","hrtkm - nákladní doprava - regionální"]
[]
[]
[null,"Komentáře"]
[]
[null,"Zpracovatel uvede konkrétní hodnoty výstupů z dopravního prognózování použité při výpočtu příjmů z poplatku za dopravní cestu. Tabulky 4.5. a 4.6. je možné přizpůsobit konkrétnímu projektu."]

{"sheet":"5 Finanční analýza (FRR_C)","index":5,"n_rows":28,"n_cols":19,"rows_kept":28,"cut":false,"hidden":false,"merged":[[1,4,2,4],[1,5,2,5],[1,6,2,6],[1,7,2,7],[13,4,14,4],[13,5,14,5],[13,6,14,6],[13,7,14,7],[27,1,27,3],[25,1,25,3],[26,1,26,3],[13,18,14,18],[13,9,14,9],[13,10,14,10],[13,16,14,16],[13,17,14,17],[13,13,14,13],[13,14,14,14],[13,15,14,15],[13,11,14,11],[13,12,14,12],[13,8,14,8],[1,18,2,18],[1,8,2,8],[1,9,2,9],[1,10,2,10],[1,11,2,11],[1,13,2,13],[1,16,2,16],[1,17,2,17],[1,14,2,14],[1,15,2,15],[1,12,2,12]]}
[]
[null,"5.1.","Kalkulace finančního vnitřního výnosového procenta",null,{"$f":"'0 Úvod'!G19","v":2016},{"$f":"E2+1","v":2017},2018,2019,2020,2021,2022,2023,2024,2025,2026,2027,2028,2029,2030]
[null,"a",null,"Celkem"]
[null,null,"Celkové přírůstkové provozní příjmy",{"$f":"SUM(E4:S4,E16:S16)","v":0},{"$f":"IF(E2<=('0 Úvod'!$G$19+'0 Úvod'!$J$19-1),'4 Tržby'!E37,0)","v":0},{"$f":"IF(F2<=('0 Úvod'!$G$19+'0 Úvod'!$J$19-1),'4 Tržby'!F37,0)","v":0},{"$f":"IF(G2<=('0 Úvod'!$G$19+'0 Úvod'!$J$19-1),'4 Tržby'!G37,0)","v":0},{"$f":"IF(H2<=('0 Úvod'!$G$19+'0 Úvod'!$J$19-1),'4 Tržby'!H37,0)","v":0},{"$f":"IF(I2<=('0 Úvod'!$G$19+'0 Úvod'!$J$19-1),'4 Tržby'!I37,0)","v":0},{"$f":"IF(J2<=('0 Úvod'!$G$19+'0 Úvod'!$J$19-1),'4 Tržby'!J37,0)","v":0},{"$f":"IF(K2<=('0 Úvod'!$G$19+'0 Úvod'!$J$19-1),'4 Tržby'!K37,0)","v":0},{"$f":"IF(L2<=('0 Úvod'!$G$19+'0 Úvod'!$J$19-1),'4 Tržby'!L37,0)","v":0},{"$f":"IF(M2<=('0 Úvod'!$G$19+'0 Úvod'!$J$19-1),'4 Tržby'!M37,0)","v":0},{"$f":"IF(N2<=('0 Úvod'!$G$19+'0 Úvod'!$J$19-1),'4 Tržby'!N37,0)","v":0},{"$f":"IF(O2<=('0 Úvod'!$G$19+'0 Úvod'!$J$19-1),'4 Tržby'!O37,0)","v":0},{"$f":"IF(P2<=('0 Úvod'!$G$19+'0 Úvod'!$J$19-1),'4 Tržby'!P37,0)","v":0},{"$f":"IF(Q2<=('0 Úvod'!$G$19+'0 Úvod'!$J$19-1),'4 Tržby'!Q37,0)","v":0},{"$f":"IF(R2<=('0 Úvod'!$G$19+'0 Úvod'!$J$19-1),'4 Tržby'!R37,0)","v":0},{"$f":"IF(S2<=('0 Úvod'!$G$19+'0 Úvod'!$J$19-1),'4 Tržby'!S37,0)","v":0}]
[null,null,"Celkové výnosy",{"$f":"SUM(D4)","v":0},{"$f":"SUM(E4)","v":0},{"$f":"SUM(F4)","v":0},0,0,0,0,0,0,0,0,0,0,0,0,0]
[null,null,"Celkové přírůstkové provozní náklady",{"$f":"SUM(E6:S6,E18:S18)","v":0},{"$f":"IF(E2<=('0 Úvod'!$G$19+'0 Úvod'!$J$19-1),'3 Provozní náklady'!E37,0)","v":0},{"$f":"IF(F2<=('0 Úvod'!$G$19+'0 Úvod'!$J$19-1),'3 Provozní náklady'!F37,0)","v":0},{"$f":"IF(G2<=('0 Úvod'!$G$19+'0 Úvod'!$J$19-1),'3 Provozní náklady'!G37,0)","v":0},{"$f":"IF(H2<=('0 Úvod'!$G$19+'0 Úvod'!$J$19-1),'3 Provozní náklady'!H37,0)","v":0},{"$f":"IF(I2<=('0 Úvod'!$G$19+'0 Úvod'!$J$19-1),'3 Provozní náklady'!I37,0)","v":0},{"$f":"IF(J2<=('0 Úvod'!$G$19+'0 Úvod'!$J$19-1),'3 Provozní náklady'!J37,0)","v":0},{"$f":"IF(K2<=('0 Úvod'!$G$19+'0 Úvod'!$J$19-1),'3 Provozní náklady'!K37,0)","v":0},{"$f":"IF(L2<=('0 Úvod'!$G$19+'0 Úvod'!$J$19-1),'3 Provozní náklady'!L37,0)","v":0},{"$f":"IF(M2<=('0 Úvod'!$G$19+'0 Úvod'!$J$19-1),'3 Provozní náklady'!M37,0)","v":0},{"$f":"IF(N2<=('0 Úvod'!$G$19+'0 Úvod'!$J$19-1),'3 Provozní náklady'!N37,0)","v":0},{"$f":"IF(O2<=('0 Úvod'!$G$19+'0 Úvod'!$J$19-1),'3 Provozní náklady'!O37,0)","v":0},{"$f":"IF(P2<=('0 Úvod'!$G$19+'0 Úvod'!$J$19-1),'3 Provozní náklady'!P37,0)","v":0},{"$f":"IF(Q2<=('0 Úvod'!$G$19+'0 Úvod'!$J$19-1),'3 Provozní náklady'!Q37,0)","v":0},{"$f":"IF(R2<=('0 Úvod'!$G$19+'0 Úvod'!$J$19-1),'3 Provozní náklady'!R37,0)","v":0},{"$f":"IF(S2<=('0 Úvod'!$G$19+'0 Úvod'!$J$19-1),'3 Provozní náklady'!S37,0)","v":0}]
[null,null,"Celkové invest. náklady bez rezervy",{"$f":"SUM(E7:S7,E19:S19)","v":0},{"$f":"'1 Celkové investiční náklady'!G11","v":0},{"$f":"'1 Celkové investiční náklady'!H11","v":0},{"$f":"'1 Celkové investiční náklady'!I11","v":0},{"$f":"'1 Celkové investiční náklady'!J11","v":0},{"$f":"'1 Celkové investiční náklady'!K11","v":0},{"$f":"'1 Celkové investiční náklady'!L11","v":0},{"$f":"'1 Celkové investiční náklady'!M11","v":0},{"$f":"'1 Celkové investiční náklady'!N11","v":0},{"$f":"'1 Celkové investiční náklady'!O11","v":0},{"$f":"'1 Celkové investiční náklady'!P11","v":0},{"$f":"'1 Celkové investiční náklady'!Q11","v":0},{"$f":"'1 Celkové investiční náklady'!R11","v":0},{"$f":"'1 Celkové investiční náklady'!S11","v":0},{"$f":"'1 Celkové investiční náklady'!T11","v":0},{"$f":"'1 Celkové investiční náklady'!U11","v":0}]
[null,null,"Zůstatková hodnota (záporná)",{"$error":"#DIV/0!"},{"$f":"IF(E2='0 Úvod'!$G$19+'0 Úvod'!$J$19-1,-1*'2 Zůstatková hodnota'!$I$7,0)","v":0},{"$f":"IF(F2='0 Úvod'!$G$19+'0 Úvod'!$J$19-1,-1*'2 Zůstatková hodnota'!$I$7,0)","v":0},{"$f":"IF(G2='0 Úvod'!$G$19+'0 Úvod'!$J$19-1,-1*'2 Zůstatková hodnota'!$I$7,0)","v":0},{"$f":"IF(H2='0 Úvod'!$G$19+'0 Úvod'!$J$19-1,-1*'2 Zůstatková hodnota'!$I$7,0)","v":0},{"$f":"IF(I2='0 Úvod'!$G$19+'0 Úvod'!$J$19-1,-1*'2 Zůstatková hodnota'!$I$7,0)","v":0},{"$f":"IF(J2='0 Úvod'!$G$19+'0 Úvod'!$J$19-1,-1*'2 Zůstatková hodnota'!$I$7,0)","v":0},{"$f":"IF(K2='0 Úvod'!$G$19+'0 Úvod'!$J$19-1,-1*'2 Zůstatková hodnota'!$I$7,0)","v":0},{"$f":"IF(L2='0 Úvod'!$G$19+'0 Úvod'!$J$19-1,-1*'2 Zůstatková hodnota'!$I$7,0)","v":0},{"$f":"IF(M2='0 Úvod'!$G$19+'0 Úvod'!$J$19-1,-1*'2 Zůstatková hodnota'!$I$7,0)","v":0},{"$f":"IF(N2='0 Úvod'!$G$19+'0 Úvod'!$J$19-1,-1*'2 Zůstatková hodnota'!$I$7,0)","v":0},{"$f":"IF(O2='0 Úvod'!$G$19+'0 Úvod'!$J$19-1,-1*'2 Zůstatková hodnota'!$I$7,0)","v":0},{"$f":"IF(P2='0 Úvod'!$G$19+'0 Úvod'!$J$19-1,-1*'2 Zůstatková hodnota'!$I$7,0)","v":0},{"$f":"IF(Q2='0 Úvod'!$G$19+'0 Úvod'!$J$19-1,-1*'2 Zůstatková hodnota'!$I$7,0)","v":0},{"$f":"IF(R2='0 Úvod'!$G$19+'0 Úvod'!$J$19-1,-1*'2 Zůstatková hodnota'!$I$7,0)","v":0},{"$f":"IF(S2='0 Úvod'!$G$19+'0 Úvod'!$J$19-1,-1*'2 Zůstatková hodnota'!$I$7,0)","v":0}]
[null,null,"Celkové náklady",{"$f":"SUM(D6:D8)","v":{"$error":"#DIV/0!"}},{"$f":"SUM(E6:E8)","v":0},{"$f":"SUM(F6:F8)","v":0},0,0,0,0,0,0,0,0,0,0,0,0,0]
[null,null,"Cash Flow ",null,{"$f":"E5-E9","v":0},0,0,0,0,0,0,0,0,0,0,0,0,0,0]
[null,null,"Diskontní sazba",{"$f":"'0 Úvod'!D21","v":0.04},1,{"$f":"E11/(1+$D$11)","v":0.96153846153846145},{"$f":"F11/(1+$D$11)","v":0.92455621301775137},{"$f":"G11*1/(1+$D$11)","v":0.88899635867091475},{"$f":"H11*1/(1+$D$11)","v":0.85480419102972571},{"$f":"I11*1/(1+$D$11)","v":0.82192710675935166},0.79031452573014582,0.75991781320206331,0.73069020500198389,0.70258673557883067,0.67556416882579873,0.64958093156326802,0.62459704958006534,0.60057408613467822,0.57747508282180593]
[null,null,"Diskontované cash flow",{"$f":"SUM(E12:S12,E24:S24)","v":{"$error":"#DIV/0!"}},{"$f":"E10*E11","v":0},{"$f":"F10*F11","v":0},0,0,0,0,0,0,0,0,0,0,0,0,0]
[null,null,null,null,{"$f":"IF(E2>='0 Úvod'!$G$21,E4-E6,0)","v":0},{"$f":"IF(F2>='0 Úvod'!$G$21,F4-F6,0)","v":0},{"$f":"IF(G2>='0 Úvod'!$G$21,G4-G6,0)","v":0},{"$f":"IF(H2>='0 Úvod'!$G$21,H4-H6,0)","v":0},{"$f":"IF(I2>='0 Úvod'!$G$21,I4-I6,0)","v":0},{"$f":"IF(J2>='0 Úvod'!$G$21,J4-J6,0)","v":0},{"$f":"IF(K2>='0 Úvod'!$G$21,K4-K6,0)","v":0},{"$f":"IF(L2>='0 Úvod'!$G$21,L4-L6,0)","v":0},{"$f":"IF(M2>='0 Úvod'!$G$21,M4-M6,0)","v":0},{"$f":"IF(N2>='0 Úvod'!$G$21,N4-N6,0)","v":0},{"$f":"IF(O2>='0 Úvod'!$G$21,O4-O6,0)","v":0},{"$f":"IF(P2>='0 Úvod'!$G$21,P4-P6,0)","v":0},{"$f":"IF(Q2>='0 Úvod'!$G$21,Q4-Q6,0)","v":0},{"$f":"IF(R2>='0 Úvod'!$G$21,R4-R6,0)","v":0},{"$f":"IF(S2>='0 Úvod'!$G$21,S4-S6,0)","v":0}]
[null,"5.1.","Kalkulace finančního vnitřního výnosového procenta",null,{"$f":"S2+1","v":2031},{"$f":"E14+1","v":2032},2033,2034,2035,2036,2037,2038,2039,2040,2041,2042,2043,2044,2045]
[null,"b"]
[null,null,{"$f":"C4","v":"Celkové přírůstkové provozní příjmy"},null,{"$f":"IF(E14<=('0 Úvod'!$G$19+'0 Úvod'!$J$19-1),'4 Tržby'!E44,0)","v":0},{"$f":"IF(F14<=('0 Úvod'!$G$19+'0 Úvod'!$J$19-1),'4 Tržby'!F44,0)","v":0},{"$f":"IF(G14<=('0 Úvod'!$G$19+'0 Úvod'!$J$19-1),'4 Tržby'!G44,0)","v":0},{"$f":"IF(H14<=('0 Úvod'!$G$19+'0 Úvod'!$J$19-1),'4 Tržby'!H44,0)","v":0},{"$f":"IF(I14<=('0 Úvod'!$G$19+'0 Úvod'!$J$19-1),'4 Tržby'!I44,0)","v":0},{"$f":"IF(J14<=('0 Úvod'!$G$19+'0 Úvod'!$J$19-1),'4 Tržby'!J44,0)","v":0},{"$f":"IF(K14<=('0 Úvod'!$G$19+'0 Úvod'!$J$19-1),'4 Tržby'!K44,0)","v":0},{"$f":"IF(L14<=('0 Úvod'!$G$19+'0 Úvod'!$J$19-1),'4 Tržby'!L44,0)","v":0},{"$f":"IF(M14<=('0 Úvod'!$G$19+'0 Úvod'!$J$19-1),'4 Tržby'!M44,0)","v":0},{"$f":"IF(N14<=('0 Úvod'!$G$19+'0 Úvod'!$J$19-1),'4 Tržby'!N44,0)","v":0},{"$f":"IF(O14<=('0 Úvod'!$G$19+'0 Úvod'!$J$19-1),'4 Tržby'!O44,0)","v":0},{"$f":"IF(P14<=('0 Úvod'!$G$19+'0 Úvod'!$J$19-1),'4 Tržby'!P44,0)","v":0},{"$f":"IF(Q14<=('0 Úvod'!$G$19+'0 Úvod'!$J$19-1),'4 Tržby'!Q44,0)","v":0},{"$f":"IF(R14<=('0 Úvod'!$G$19+'0 Úvod'!$J$19-1),'4 Tržby'!R44,0)","v":0},{"$f":"IF(S14<=('0 Úvod'!$G$19+'0 Úvod'!$J$19-1),'4 Tržby'!S44,0)","v":0}]
[null,null,"Celkové výnosy",null,{"$f":"SUM(E16)","v":0},{"$f":"SUM(F16)","v":0},0,0,0,0,0,0,0,0,0,0,0,0,0]
[null,null,"Celkové přírůstkové provozní náklady",null,{"$f":"IF(E14<=('0 Úvod'!$G$19+'0 Úvod'!$J$19-1),'3 Provozní náklady'!E44,0)","v":0},{"$f":"IF(F14<=('0 Úvod'!$G$19+'0 Úvod'!$J$19-1),'3 Provozní náklady'!F44,0)","v":0},{"$f":"IF(G14<=('0 Úvod'!$G$19+'0 Úvod'!$J$19-1),'3 Provozní náklady'!G44,0)","v":0},{"$f":"IF(H14<=('0 Úvod'!$G$19+'0 Úvod'!$J$19-1),'3 Provozní náklady'!H44,0)","v":0},{"$f":"IF(I14<=('0 Úvod'!$G$19+'0 Úvod'!$J$19-1),'3 Provozní náklady'!I44,0)","v":0},{"$f":"IF(J14<=('0 Úvod'!$G$19+'0 Úvod'!$J$19-1),'3 Provozní náklady'!J44,0)","v":0},{"$f":"IF(K14<=('0 Úvod'!$G$19+'0 Úvod'!$J$19-1),'3 Provozní náklady'!K44,0)","v":0},{"$f":"IF(L14<=('0 Úvod'!$G$19+'0 Úvod'!$J$19-1),'3 Provozní náklady'!L44,0)","v":0},{"$f":"IF(M14<=('0 Úvod'!$G$19+'0 Úvod'!$J$19-1),'3 Provozní náklady'!M44,0)","v":0},{"$f":"IF(N14<=('0 Úvod'!$G$19+'0 Úvod'!$J$19-1),'3 Provozní náklady'!N44,0)","v":0},{"$f":"IF(O14<=('0 Úvod'!$G$19+'0 Úvod'!$J$19-1),'3 Provozní náklady'!O44,0)","v":0},{"$f":"IF(P14<=('0 Úvod'!$G$19+'0 Úvod'!$J$19-1),'3 Provozní náklady'!P44,0)","v":0},{"$f":"IF(Q14<=('0 Úvod'!$G$19+'0 Úvod'!$J$19-1),'3 Provozní náklady'!Q44,0)","v":0},{"$f":"IF(R14<=('0 Úvod'!$G$19+'0 Úvod'!$J$19-1),'3 Provozní náklady'!R44,0)","v":0},{"$f":"IF(S14<=('0 Úvod'!$G$19+'0 Úvod'!$J$19-1),'3 Provozní náklady'!S44,0)","v":0}]
[null,null,"Celkové invest. náklady bez rezervy",null,{"$f":"'1 Celkové investiční náklady'!G26","v":0},{"$f":"'1 Celkové investiční náklady'!H26","v":0},{"$f":"'1 Celkové investiční náklady'!I26","v":0},{"$f":"'1 Celkové investiční náklady'!J26","v":0},{"$f":"'1 Celkové investiční náklady'!K26","v":0},{"$f":"'1 Celkové investiční náklady'!L26","v":0},{"$f":"'1 Celkové investiční náklady'!M26","v":0},{"$f":"'1 Celkové investiční náklady'!N26","v":0},{"$f":"'1 Celkové investiční náklady'!O26","v":0},{"$f":"'1 Celkové investiční náklady'!P26","v":0},{"$f":"'1 Celkové investiční náklady'!Q26","v":0},{"$f":"'1 Celkové investiční náklady'!R26","v":0},{"$f":"'1 Celkové investiční náklady'!S26","v":0},{"$f":"'1 Celkové investiční náklady'!T26","v":0},{"$f":"'1 Celkové investiční náklady'!U26","v":0}]
[null,null,"Zůstatková hodnota (záporná)",null,{"$f":"IF(E14='0 Úvod'!$G$19+'0 Úvod'!$J$19-1,-1*'2 Zůstatková hodnota'!$I$7,0)","v":0},{"$f":"IF(F14='0 Úvod'!$G$19+'0 Úvod'!$J$19-1,-1*'2 Zůstatková hodnota'!$I$7,0)","v":0},{"$f":"IF(G14='0 Úvod'!$G$19+'0 Úvod'!$J$19-1,-1*'2 Zůstatková hodnota'!$I$7,0)","v":0},{"$f":"IF(H14='0 Úvod'!$G$19+'0 Úvod'!$J$19-1,-1*'2 Zůstatková hodnota'!$I$7,0)","v":0},{"$f":"IF(I14='0 Úvod'!$G$19+'0 Úvod'!$J$19-1,-1*'2 Zůstatková hodnota'!$I$7,0)","v":0},{"$f":"IF(J14='0 Úvod'!$G$19+'0 Úvod'!$J$19-1,-1*'2 Zůstatková hodnota'!$I$7,0)","v":0},{"$f":"IF(K14='0 Úvod'!$G$19+'0 Úvod'!$J$19-1,-1*'2 Zůstatková hodnota'!$I$7,0)","v":0},{"$f":"IF(L14='0 Úvod'!$G$19+'0 Úvod'!$J$19-1,-1*'2 Zůstatková hodnota'!$I$7,0)","v":0},{"$f":"IF(M14='0 Úvod'!$G$19+'0 Úvod'!$J$19-1,-1*'2 Zůstatková hodnota'!$I$7,0)","v":0},{"$f":"IF(N14='0 Úvod'!$G$19+'0 Úvod'!$J$19-1,-1*'2 Zůstatková hodnota'!$I$7,0)","v":0},{"$f":"IF(O14='0 Úvod'!$G$19+'0 Úvod'!$J$19-1,-1*'2 Zůstatková hodnota'!$I$7,0)","v":0},{"$f":"IF(P14='0 Úvod'!$G$19+'0 Úvod'!$J$19-1,-1*'2 Zůstatková hodnota'!$I$7,0)","v":0},{"$f":"IF(Q14='0 Úvod'!$G$19+'0 Úvod'!$J$19-1,-1*'2 Zůstatková hodnota'!$I$7,0)","v":0},{"$f":"IF(R14='0 Úvod'!$G$19+'0 Úvod'!$J$19-1,-1*'2 Zůstatková hodnota'!$I$7,0)","v":0},{"$f":"IF(S14='0 Úvod'!$G$19+'0 Úvod'!$J$19-1,-1*'2 Zůstatková hodnota'!$I$7,0)","v":{"$error":"#DIV/0!"}}]
[null,null,"Celkové náklady",null,{"$f":"SUM(E18:E20)","v":0},{"$f":"SUM(F18:F20)","v":0},0,0,0,0,0,0,0,0,0,0,0,0,{"$error":"#DIV/0!"}]
[null,null,"Cash Flow ",null,{"$f":"E17-E21","v":0},0,0,0,0,0,0,0,0,0,0,0,0,0,{"$error":"#DIV/0!"}]
[null,null,"Diskontní sazba",{"$f":"D11","v":0.04},{"$f":"S11*1/(1+$D$11)","v":0.55526450271327488},{"$f":"E23*1/(1+$D$11)","v":0.53390817568584126},{"$f":"F23*1/(1+$D$11)","v":0.51337324585177047},0.49362812101131776,0.47464242404934398,0.45638694620129228,0.4388336021166272,0.42195538665060306,0.40572633331788754,0.39012147434412264,0.37511680225396404,0.3606892329365039,0.34681657013125372,0.33347747128005162,0.32065141469235731]
[null,null,"Diskontované cash flow",null,{"$f":"E22*E23","v":0},0,0,0,0,0,0,0,0,0,0,0,0,0,{"$error":"#DIV/0!"}]
[null,null,null,null,{"$f":"IF(E14>='0 Úvod'!$G$21,E16-E18,0)","v":0},{"$f":"IF(F14>='0 Úvod'!$G$21,F16-F18,0)","v":0},{"$f":"IF(G14>='0 Úvod'!$G$21,G16-G18,0)","v":0},{"$f":"IF(H14>='0 Úvod'!$G$21,H16-H18,0)","v":0},{"$f":"IF(I14>='0 Úvod'!$G$21,I16-I18,0)","v":0},{"$f":"IF(J14>='0 Úvod'!$G$21,J16-J18,0)","v":0},{"$f":"IF(K14>='0 Úvod'!$G$21,K16-K18,0)","v":0},{"$f":"IF(L14>='0 Úvod'!$G$21,L16-L18,0)","v":0},{"$f":"IF(M14>='0 Úvod'!$G$21,M16-M18,0)","v":0},{"$f":"IF(N14>='0 Úvod'!$G$21,N16-N18,0)","v":0},{"$f":"IF(O14>='0 Úvod'!$G$21,O16-O18,0)","v":0},{"$f":"IF(P14>='0 Úvod'!$G$21,P16-P18,0)","v":0},{"$f":"IF(Q14>='0 Úvod'!$G$21,Q16-Q18,0)","v":0},{"$f":"IF(R14>='0 Úvod'!$G$21,R16-R18,0)","v":0},{"$f":"IF(S14>='0 Úvod'!$G$21,S16-S18,0)","v":0}]
[null,"Finanční vnitřní výnosové procento investice FRR/C",null,null,{"$f":"ROUND(IRR((E10:S10,E22:S22),0.05),4)","v":{"$error":"#VALUE!"}}]
[null,"Finanční čistá současná hodnota investice FNPV/C (CZK)",null,null,{"$f":"E10+NPV('0 Úvod'!D21,(F10:S10,E22:S22))","v":{"$error":"#DIV/0!"}}]
[null,"Finanční čistá současná hodnota investice FNPV/C (EUR)",null,null,{"$f":"E27/'0 Úvod'!N19","v":{"$error":"#DIV/0!"}}]

{"sheet":"6 Kontrola dotací","index":6,"n_rows":51,"n_cols":19,"rows_kept":51,"cut":false,"hidden":false,"merged":[[23,8,24,8],[38,7,39,7],[38,8,39,8],[38,4,39,4],[38,5,39,5],[31,7,32,7],[31,8,32,8],[23,18,24,18],[23,13,24,13],[23,17,24,17],[23,12,24,12],[38,17,39,17],[38,18,39,18],[31,17,32,17],[31,18,32,18],[23,10,24,10],[23,11,24,11],[23,9,24,9],[38,16,39,16],[31,11,32,11],[31,12,32,12],[31,13,32,13],[38,15,39,15],[38,10,39,10],[38,9,39,9],[38,13,39,13],[38,14,39,14],[31,14,32,14],[38,11,39,11],[38,12,39,12],[46,1,47,15],[31,4,32,4],[31,5,32,5],[31,6,32,6],[23,16,24,16],[23,4,24,4],[23,5,24,5],[23,6,24,6],[23,7,24,7],[38,6,39,6],[31,15,32,15],[31,16,32,16],[23,14,24,14],[23,15,24,15],[31,9,32,9],[31,10,32,10],[8,12,9,12],[16,13,17,13],[16,14,17,14],[16,17,17,17],[16,11,17,11],[16,12,17,12],[16,15,17,15],[16,16,17,16],[16,18,17,18],[16,10,17,10],[8,7,9,7],[8,8,9,8],[16,7,17,7],[16,8,17,8],[16,9,17,9],[8,9,9,9],[8,10,9,10],[8,18,9,18],[8,13,9,13],[8,14,9,14],[8,15,9,15],[8,16,9,16],[8,17,9,17],[8,11,9,11],[1,17,2,17],[1,18,2,18],[1,7,2,7],[1,8,2,8],[1,9,2,9],[1,10,2,10],[1,11,2,11],[1,12,2,12],[1,13,2,13],[1,14,2,14],[1,15,2,15],[1,16,2,16],[16,4,17,4],[16,5,17,5],[8,5,9,5],[16,6,17,6],[1,6,2,6],[8,4,9,4],[8,6,9,6],[1,4,2,4],[1,5,2,5]]}
[]
[null,"6.1.","S projektem",null,{"$f":"'0 Úvod'!G19","v":2016},{"$f":"E2+1","v":2017},2018,2019,2020,2021,2022,2023,2024,2025,2026,{"$f":"O2+1","v":2027},2028,2029,2030]
[null,"a",null,"Celkem"]
[null,"A","Náklady na údržbu a opravy",{"$f":"SUM(E4:S4,E11:S11)","v":0},{"$f":"'3 Provozní náklady'!E4+'3 Provozní náklady'!E5","v":0},{"$f":"'3 Provozní náklady'!F4+'3 Provozní náklady'!F5","v":0},{"$f":"'3 Provozní náklady'!G4+'3 Provozní náklady'!G5","v":0},{"$f":"'3 Provozní náklady'!H4+'3 Provozní náklady'!H5","v":0},{"$f":"'3 Provozní náklady'!I4+'3 Provozní náklady'!I5","v":0},{"$f":"'3 Provozní náklady'!J4+'3 Provozní náklady'!J5","v":0},{"$f":"'3 Provozní náklady'!K4+'3 Provozní náklady'!K5","v":0},{"$f":"'3 Provozní náklady'!L4+'3 Provozní náklady'!L5","v":0},{"$f":"'3 Provozní náklady'!M4+'3 Provozní náklady'!M5","v":0},{"$f":"'3 Provozní náklady'!N4+'3 Provozní náklady'!N5","v":0},{"$f":"'3 Provozní náklady'!O4+'3 Provozní náklady'!O5","v":0},{"$f":"'3 Provozní náklady'!P4+'3 Provozní náklady'!P5","v":0},{"$f":"'3 Provozní náklady'!Q4+'3 Provozní náklady'!Q5","v":0},{"$f":"'3 Provozní náklady'!R4+'3 Provozní náklady'!R5","v":0},{"$f":"'3 Provozní náklady'!S4+'3 Provozní náklady'!S5","v":0}]
[null,"B","Náklady na řízení provozu",{"$f":"SUM(E5:S5,E12:S12)","v":0},{"$f":"'3 Provozní náklady'!E6","v":0},{"$f":"'3 Provozní náklady'!F6","v":0},{"$f":"'3 Provozní náklady'!G6","v":0},{"$f":"'3 Provozní náklady'!H6","v":0},{"$f":"'3 Provozní náklady'!I6","v":0},{"$f":"'3 Provozní náklady'!J6","v":0},{"$f":"'3 Provozní náklady'!K6","v":0},{"$f":"'3 Provozní náklady'!L6","v":0},{"$f":"'3 Provozní náklady'!M6","v":0},{"$f":"'3 Provozní náklady'!N6","v":0},{"$f":"'3 Provozní náklady'!O6","v":0},{"$f":"'3 Provozní náklady'!P6","v":0},{"$f":"'3 Provozní náklady'!Q6","v":0},{"$f":"'3 Provozní náklady'!R6","v":0},{"$f":"'3 Provozní náklady'!S6","v":0}]
[null,"C","Příjmy z poplatků za dopravní cestu*",0,{"$f":"'4 Tržby'!E4+'4 Tržby'!E5","v":0},{"$f":"'4 Tržby'!F4+'4 Tržby'!F5","v":0},{"$f":"'4 Tržby'!G4+'4 Tržby'!G5","v":0},{"$f":"'4 Tržby'!H4+'4 Tržby'!H5","v":0},{"$f":"'4 Tržby'!I4+'4 Tržby'!I5","v":0},{"$f":"'4 Tržby'!J4+'4 Tržby'!J5","v":0},{"$f":"'4 Tržby'!K4+'4 Tržby'!K5","v":0},{"$f":"'4 Tržby'!L4+'4 Tržby'!L5","v":0},{"$f":"'4 Tržby'!M4+'4 Tržby'!M5","v":0},{"$f":"'4 Tržby'!N4+'4 Tržby'!N5","v":0},{"$f":"'4 Tržby'!O4+'4 Tržby'!O5","v":0},{"$f":"'4 Tržby'!P4+'4 Tržby'!P5","v":0},{"$f":"'4 Tržby'!Q4+'4 Tržby'!Q5","v":0},{"$f":"'4 Tržby'!R4+'4 Tržby'!R5","v":0},{"$f":"'4 Tržby'!S4+'4 Tržby'!S5","v":0}]
[null,"D","Provozní dotace",0,{"$f":"IF((E4+E5-E6)>0,E4+E5-E6,0)","v":0},{"$f":"IF((F4+F5-F6)>0,F4+F5-F6,0)","v":0},0,0,0,0,0,0,0,0,0,0,0,0,0]
[]
[null,"6.1.","S projektem",null,{"$f":"S2+1","v":2031},{"$f":"E9+1","v":2032},2033,2034,2035,2036,2037,2038,2039,2040,2041,{"$f":"O9+1","v":2042},2043,2044,2045]
[null,"b"]
[null,"A","Náklady na údržbu a opravy",null,{"$f":"'3 Provozní náklady'!E11+'3 Provozní náklady'!E12","v":0},{"$f":"'3 Provozní náklady'!F11+'3 Provozní náklady'!F12","v":0},{"$f":"'3 Provozní náklady'!G11+'3 Provozní náklady'!G12","v":0},{"$f":"'3 Provozní náklady'!H11+'3 Provozní náklady'!H12","v":0},{"$f":"'3 Provozní náklady'!I11+'3 Provozní náklady'!I12","v":0},{"$f":"'3 Provozní náklady'!J11+'3 Provozní náklady'!J12","v":0},{"$f":"'3 Provozní náklady'!K11+'3 Provozní náklady'!K12","v":0},{"$f":"'3 Provozní náklady'!L11+'3 Provozní náklady'!L12","v":0},{"$f":"'3 Provozní náklady'!M11+'3 Provozní náklady'!M12","v":0},{"$f":"'3 Provozní náklady'!N11+'3 Provozní náklady'!N12","v":0},{"$f":"'3 Provozní náklady'!O11+'3 Provozní náklady'!O12","v":0},{"$f":"'3 Provozní náklady'!P11+'3 Provozní náklady'!P12","v":0},{"$f":"'3 Provozní náklady'!Q11+'3 Provozní náklady'!Q12","v":0},{"$f":"'3 Provozní náklady'!R11+'3 Provozní náklady'!R12","v":0},{"$f":"'3 Provozní náklady'!S11+'3 Provozní náklady'!S12","v":0}]
[null,"B","Náklady na řízení provozu",null,{"$f":"'3 Provozní náklady'!E13","v":0},{"$f":"'3 Provozní náklady'!F13","v":0},{"$f":"'3 Provozní náklady'!G13","v":0},{"$f":"'3 Provozní náklady'!H13","v":0},{"$f":"'3 Provozní náklady'!I13","v":0},{"$f":"'3 Provozní náklady'!J13","v":0},{"$f":"'3 Provozní náklady'!K13","v":0},{"$f":"'3 Provozní náklady'!L13","v":0},{"$f":"'3 Provozní náklady'!M13","v":0},{"$f":"'3 Provozní náklady'!N13","v":0},{"$f":"'3 Provozní náklady'!O13","v":0},{"$f":"'3 Provozní náklady'!P13","v":0},{"$f":"'3 Provozní náklady'!Q13","v":0},{"$f":"'3 Provozní náklady'!R13","v":0},{"$f":"'3 Provozní náklady'!S13","v":0}]
[null,"C","Příjmy z poplatků za dopravní cestu*",null,{"$f":"'4 Tržby'!E11+'4 Tržby'!E12","v":0},{"$f":"'4 Tržby'!F11+'4 Tržby'!F12","v":0},{"$f":"'4 Tržby'!G11+'4 Tržby'!G12","v":0},{"$f":"'4 Tržby'!H11+'4 Tržby'!H12","v":0},{"$f":"'4 Tržby'!I11+'4 Tržby'!I12","v":0},{"$f":"'4 Tržby'!J11+'4 Tržby'!J12","v":0},{"$f":"'4 Tržby'!K11+'4 Tržby'!K12","v":0},{"$f":"'4 Tržby'!L11+'4 Tržby'!L12","v":0},{"$f":"'4 Tržby'!M11+'4 Tržby'!M12","v":0},{"$f":"'4 Tržby'!N11+'4 Tržby'!N12","v":0},{"$f":"'4 Tržby'!O11+'4 Tržby'!O12","v":0},{"$f":"'4 Tržby'!P11+'4 Tržby'!P12","v":0},{"$f":"'4 Tržby'!Q11+'4 Tržby'!Q12","v":0},{"$f":"'4 Tržby'!R11+'4 Tržby'!R12","v":0},{"$f":"'4 Tržby'!S11+'4 Tržby'!S12","v":0}]
[null,"D","Provozní dotace",null,{"$f":"IF((E11+E12-E13)>0,E11+E12-E13,0)","v":0},{"$f":"IF((F11+F12-F13)>0,F11+F12-F13,0)","v":0},0,0,0,0,0,0,0,0,0,0,0,0,0]
[]
[]
[null,"6.2.","Bez projektu",null,{"$f":"E2","v":2016},{"$f":"E17+1","v":2017},2018,2019,2020,2021,2022,2023,2024,2025,2026,{"$f":"O17+1","v":2027},2028,2029,2030]
[null,"a",null,"Celkem"]
[null,"E","Náklady na údržbu a opravy",{"$f":"SUM(E19:S19,E26:S26)","v":0},{"$f":"'3 Provozní náklady'!E19+'3 Provozní náklady'!E20","v":0},{"$f":"'3 Provozní náklady'!F19+'3 Provozní náklady'!F20","v":0},{"$f":"'3 Provozní náklady'!G19+'3 Provozní náklady'!G20","v":0},{"$f":"'3 Provozní náklady'!H19+'3 Provozní náklady'!H20","v":0},{"$f":"'3 Provozní náklady'!I19+'3 Provozní náklady'!I20","v":0},{"$f":"'3 Provozní náklady'!J19+'3 Provozní náklady'!J20","v":0},{"$f":"'3 Provozní náklady'!K19+'3 Provozní náklady'!K20","v":0},{"$f":"'3 Provozní náklady'!L19+'3 Provozní náklady'!L20","v":0},{"$f":"'3 Provozní náklady'!M19+'3 Provozní náklady'!M20","v":0},{"$f":"'3 Provozní náklady'!N19+'3 Provozní náklady'!N20","v":0},{"$f":"'3 Provozní náklady'!O19+'3 Provozní náklady'!O20","v":0},{"$f":"'3 Provozní náklady'!P19+'3 Provozní náklady'!P20","v":0},{"$f":"'3 Provozní náklady'!Q19+'3 Provozní náklady'!Q20","v":0},{"$f":"'3 Provozní náklady'!R19+'3 Provozní náklady'!R20","v":0},{"$f":"'3 Provozní náklady'!S19+'3 Provozní náklady'!S20","v":0}]
[null,"F","Náklady na řízení provozu",{"$f":"SUM(E20:S20,E27:S27)","v":0},{"$f":"'3 Provozní náklady'!E21","v":0},{"$f":"'3 Provozní náklady'!F21","v":0},{"$f":"'3 Provozní náklady'!G21","v":0},{"$f":"'3 Provozní náklady'!H21","v":0},{"$f":"'3 Provozní náklady'!I21","v":0},{"$f":"'3 Provozní náklady'!J21","v":0},{"$f":"'3 Provozní náklady'!K21","v":0},{"$f":"'3 Provozní náklady'!L21","v":0},{"$f":"'3 Provozní náklady'!M21","v":0},{"$f":"'3 Provozní náklady'!N21","v":0},{"$f":"'3 Provozní náklady'!O21","v":0},{"$f":"'3 Provozní náklady'!P21","v":0},{"$f":"'3 Provozní náklady'!Q21","v":0},{"$f":"'3 Provozní náklady'!R21","v":0},{"$f":"'3 Provozní náklady'!S21","v":0}]
[null,"G","Příjmy z poplatků za dopravní cestu*",0,{"$f":"'4 Tržby'!E19+'4 Tržby'!E20","v":0},{"$f":"'4 Tržby'!F19+'4 Tržby'!F20","v":0},{"$f":"'4 Tržby'!G19+'4 Tržby'!G20","v":0},{"$f":"'4 Tržby'!H19+'4 Tržby'!H20","v":0},{"$f":"'4 Tržby'!I19+'4 Tržby'!I20","v":0},{"$f":"'4 Tržby'!J19+'4 Tržby'!J20","v":0},{"$f":"'4 Tržby'!K19+'4 Tržby'!K20","v":0},{"$f":"'4 Tržby'!L19+'4 Tržby'!L20","v":0},{"$f":"'4 Tržby'!M19+'4 Tržby'!M20","v":0},{"$f":"'4 Tržby'!N19+'4 Tržby'!N20","v":0},{"$f":"'4 Tržby'!O19+'4 Tržby'!O20","v":0},{"$f":"'4 Tržby'!P19+'4 Tržby'!P20","v":0},{"$f":"'4 Tržby'!Q19+'4 Tržby'!Q20","v":0},{"$f":"'4 Tržby'!R19+'4 Tržby'!R20","v":0},{"$f":"'4 Tržby'!S19+'4 Tržby'!S20","v":0}]
[null,"H","Provozní dotace",0,{"$f":"IF((E19+E20-E21)>0,E19+E20-E21,0)","v":0},{"$f":"IF((F19+F20-F21)>0,F19+F20-F21,0)","v":0},0,0,0,0,0,0,0,0,0,0,0,0,0]
[]
[null,"6.2.","Bez projektu",null,{"$f":"S17+1","v":2031},{"$f":"E24+1","v":2032},2033,2034,2035,2036,2037,2038,2039,2040,2041,{"$f":"O24+1","v":2042},2043,2044,2045]
[null,"b"]
[null,"E","Náklady na údržbu a opravy",null,{"$f":"'3 Provozní náklady'!E26+'3 Provozní náklady'!E27","v":0},{"$f":"'3 Provozní náklady'!F26+'3 Provozní náklady'!F27","v":0},{"$f":"'3 Provozní náklady'!G26+'3 Provozní náklady'!G27","v":0},{"$f":"'3 Provozní náklady'!H26+'3 Provozní náklady'!H27","v":0},{"$f":"'3 Provozní náklady'!I26+'3 Provozní náklady'!I27","v":0},{"$f":"'3 Provozní náklady'!J26+'3 Provozní náklady'!J27","v":0},{"$f":"'3 Provozní náklady'!K26+'3 Provozní náklady'!K27","v":0},{"$f":"'3 Provozní náklady'!L26+'3 Provozní náklady'!L27","v":0},{"$f":"'3 Provozní náklady'!M26+'3 Provozní náklady'!M27","v":0},{"$f":"'3 Provozní náklady'!N26+'3 Provozní náklady'!N27","v":0},{"$f":"'3 Provozní náklady'!O26+'3 Provozní náklady'!O27","v":0},{"$f":"'3 Provozní náklady'!P26+'3 Provozní náklady'!P27","v":0},{"$f":"'3 Provozní náklady'!Q26+'3 Provozní náklady'!Q27","v":0},{"$f":"'3 Provozní náklady'!R26+'3 Provozní náklady'!R27","v":0},{"$f":"'3 Provozní náklady'!S26+'3 Provozní náklady'!S27","v":0}]
[null,"F","Náklady na řízení provozu",null,{"$f":"'3 Provozní náklady'!E28","v":0},{"$f":"'3 Provozní náklady'!F28","v":0},{"$f":"'3 Provozní náklady'!G28","v":0},{"$f":"'3 Provozní náklady'!H28","v":0},{"$f":"'3 Provozní náklady'!I28","v":0},{"$f":"'3 Provozní náklady'!J28","v":0},{"$f":"'3 Provozní náklady'!K28","v":0},{"$f":"'3 Provozní náklady'!L28","v":0},{"$f":"'3 Provozní náklady'!M28","v":0},{"$f":"'3 Provozní náklady'!N28","v":0},{"$f":"'3 Provozní náklady'!O28","v":0},{"$f":"'3 Provozní náklady'!P28","v":0},{"$f":"'3 Provozní náklady'!Q28","v":0},{"$f":"'3 Provozní náklady'!R28","v":0},{"$f":"'3 Provozní náklady'!S28","v":0}]
[null,"G","Příjmy z poplatků za dopravní cestu*",null,{"$f":"'4 Tržby'!E26+'4 Tržby'!E27","v":0},{"$f":"'4 Tržby'!F26+'4 Tržby'!F27","v":0},{"$f":"'4 Tržby'!G26+'4 Tržby'!G27","v":0},{"$f":"'4 Tržby'!H26+'4 Tržby'!H27","v":0},{"$f":"'4 Tržby'!I26+'4 Tržby'!I27","v":0},{"$f":"'4 Tržby'!J26+'4 Tržby'!J27","v":0},{"$f":"'4 Tržby'!K26+'4 Tržby'!K27","v":0},{"$f":"'4 Tržby'!L26+'4 Tržby'!L27","v":0},{"$f":"'4 Tržby'!M26+'4 Tržby'!M27","v":0},{"$f":"'4 Tržby'!N26+'4 Tržby'!N27","v":0},{"$f":"'4 Tržby'!O26+'4 Tržby'!O27","v":0},{"$f":"'4 Tržby'!P26+'4 Tržby'!P27","v":0},{"$f":"'4 Tržby'!Q26+'4 Tržby'!Q27","v":0},{"$f":"'4 Tržby'!R26+'4 Tržby'!R27","v":0},{"$f":"'4 Tržby'!S26+'4 Tržby'!S27","v":0}]
[null,"H","Provozní dotace",null,{"$f":"IF((E26+E27-E28)>0,E26+E27-E28,0)","v":0},{"$f":"IF((F26+F27-F28)>0,F26+F27-F28,0)","v":0},0,0,0,0,0,0,0,0,0,0,0,0,0]
[]
[]
[null,"6.3.","Redukce dotací",null,{"$f":"E2","v":2016},{"$f":"E32+1","v":2017},2018,2019,2020,2021,2022,2023,2024,2025,2026,{"$f":"O32+1","v":2027},2028,2029,2030]
[null,"a",null,"Celkem"]
[null,"I","Redukce přírůstkových provozních nákladů",{"$f":"SUM(E34:S34,E41:S41)","v":0},{"$f":"IF(E32<='0 Úvod'!$G$19+'0 Úvod'!$J$19-1,(E19+E20)-(E4+E5),0)","v":0},{"$f":"IF(F32<='0 Úvod'!$G$19+'0 Úvod'!$J$19-1,(F19+F20)-(F4+F5),0)","v":0},{"$f":"IF(G32<='0 Úvod'!$G$19+'0 Úvod'!$J$19-1,(G19+G20)-(G4+G5),0)","v":0},{"$f":"IF(H32<='0 Úvod'!$G$19+'0 Úvod'!$J$19-1,(H19+H20)-(H4+H5),0)","v":0},{"$f":"IF(I32<='0 Úvod'!$G$19+'0 Úvod'!$J$19-1,(I19+I20)-(I4+I5),0)","v":0},{"$f":"IF(J32<='0 Úvod'!$G$19+'0 Úvod'!$J$19-1,(J19+J20)-(J4+J5),0)","v":0},{"$f":"IF(K32<='0 Úvod'!$G$19+'0 Úvod'!$J$19-1,(K19+K20)-(K4+K5),0)","v":0},{"$f":"IF(L32<='0 Úvod'!$G$19+'0 Úvod'!$J$19-1,(L19+L20)-(L4+L5),0)","v":0},{"$f":"IF(M32<='0 Úvod'!$G$19+'0 Úvod'!$J$19-1,(M19+M20)-(M4+M5),0)","v":0},{"$f":"IF(N32<='0 Úvod'!$G$19+'0 Úvod'!$J$19-1,(N19+N20)-(N4+N5),0)","v":0},{"$f":"IF(O32<='0 Úvod'!$G$19+'0 Úvod'!$J$19-1,(O19+O20)-(O4+O5),0)","v":0},{"$f":"IF(P32<='0 Úvod'!$G$19+'0 Úvod'!$J$19-1,(P19+P20)-(P4+P5),0)","v":0},{"$f":"IF(Q32<='0 Úvod'!$G$19+'0 Úvod'!$J$19-1,(Q19+Q20)-(Q4+Q5),0)","v":0},{"$f":"IF(R32<='0 Úvod'!$G$19+'0 Úvod'!$J$19-1,(R19+R20)-(R4+R5),0)","v":0},{"$f":"IF(S32<='0 Úvod'!$G$19+'0 Úvod'!$J$19-1,(S19+S20)-(S4+S5),0)","v":0}]
[null,"J","Redukce provozních dotací",{"$f":"SUM(E35:S35,E42:S42)","v":0},{"$f":"IF(E32<='0 Úvod'!$G$19+'0 Úvod'!$J$19-1,E22-E7,0)","v":0},{"$f":"IF(F32<='0 Úvod'!$G$19+'0 Úvod'!$J$19-1,F22-F7,0)","v":0},{"$f":"IF(G32<='0 Úvod'!$G$19+'0 Úvod'!$J$19-1,G22-G7,0)","v":0},{"$f":"IF(H32<='0 Úvod'!$G$19+'0 Úvod'!$J$19-1,H22-H7,0)","v":0},{"$f":"IF(I32<='0 Úvod'!$G$19+'0 Úvod'!$J$19-1,I22-I7,0)","v":0},{"$f":"IF(J32<='0 Úvod'!$G$19+'0 Úvod'!$J$19-1,J22-J7,0)","v":0},{"$f":"IF(K32<='0 Úvod'!$G$19+'0 Úvod'!$J$19-1,K22-K7,0)","v":0},{"$f":"IF(L32<='0 Úvod'!$G$19+'0 Úvod'!$J$19-1,L22-L7,0)","v":0},{"$f":"IF(M32<='0 Úvod'!$G$19+'0 Úvod'!$J$19-1,M22-M7,0)","v":0},{"$f":"IF(N32<='0 Úvod'!$G$19+'0 Úvod'!$J$19-1,N22-N7,0)","v":0},{"$f":"IF(O32<='0 Úvod'!$G$19+'0 Úvod'!$J$19-1,O22-O7,0)","v":0},{"$f":"IF(P32<='0 Úvod'!$G$19+'0 Úvod'!$J$19-1,P22-P7,0)","v":0},{"$f":"IF(Q32<='0 Úvod'!$G$19+'0 Úvod'!$J$19-1,Q22-Q7,0)","v":0},{"$f":"IF(R32<='0 Úvod'!$G$19+'0 Úvod'!$J$19-1,R22-R7,0)","v":0},{"$f":"IF(S32<='0 Úvod'!$G$19+'0 Úvod'!$J$19-1,S22-S7,0)","v":0}]
[null,null,"Je snížení prov. nákladů plně kompenzováno snížením dotací",{"$f":"IF(D35>=D34,\"ANO\",\"NE\")","v":"ANO"},{"$f":"IF(E35>=E34,\"ANO\",\"NE\")","v":"ANO"},{"$f":"IF(F35>=F34,\"ANO\",\"NE\")","v":"ANO"},{"$f":"IF(G35>=G34,\"ANO\",\"NE\")","v":"ANO"},"ANO","ANO","ANO","ANO","ANO","ANO","ANO","ANO","ANO","ANO","ANO","ANO"]
[null,"K","Čistá úspora provozních nákladů**",{"$f":"SUM(E44:S44,E37:S37)","v":0},{"$f":"E35-E34","v":0},0,0,0,0,0,0,0,0,0,0,0,0,0,0]
[]
[null,"6.3.","Redukce dotací",null,{"$f":"S32+1","v":2031},{"$f":"E39+1","v":2032},2033,2034,2035,2036,2037,2038,2039,2040,2041,{"$f":"O39+1","v":2042},2043,2044,2045]
[null,"b"]
[null,"I","Redukce přírůstkových provozních nákladů",null,{"$f":"IF(E39<='0 Úvod'!$G$19+'0 Úvod'!$J$19-1,(E26+E27)-(E11+E12),0)","v":0},{"$f":"IF(F39<='0 Úvod'!$G$19+'0 Úvod'!$J$19-1,(F26+F27)-(F11+F12),0)","v":0},{"$f":"IF(G39<='0 Úvod'!$G$19+'0 Úvod'!$J$19-1,(G26+G27)-(G11+G12),0)","v":0},{"$f":"IF(H39<='0 Úvod'!$G$19+'0 Úvod'!$J$19-1,(H26+H27)-(H11+H12),0)","v":0},{"$f":"IF(I39<='0 Úvod'!$G$19+'0 Úvod'!$J$19-1,(I26+I27)-(I11+I12),0)","v":0},{"$f":"IF(J39<='0 Úvod'!$G$19+'0 Úvod'!$J$19-1,(J26+J27)-(J11+J12),0)","v":0},{"$f":"IF(K39<='0 Úvod'!$G$19+'0 Úvod'!$J$19-1,(K26+K27)-(K11+K12),0)","v":0},{"$f":"IF(L39<='0 Úvod'!$G$19+'0 Úvod'!$J$19-1,(L26+L27)-(L11+L12),0)","v":0},{"$f":"IF(M39<='0 Úvod'!$G$19+'0 Úvod'!$J$19-1,(M26+M27)-(M11+M12),0)","v":0},{"$f":"IF(N39<='0 Úvod'!$G$19+'0 Úvod'!$J$19-1,(N26+N27)-(N11+N12),0)","v":0},{"$f":"IF(O39<='0 Úvod'!$G$19+'0 Úvod'!$J$19-1,(O26+O27)-(O11+O12),0)","v":0},{"$f":"IF(P39<='0 Úvod'!$G$19+'0 Úvod'!$J$19-1,(P26+P27)-(P11+P12),0)","v":0},{"$f":"IF(Q39<='0 Úvod'!$G$19+'0 Úvod'!$J$19-1,(Q26+Q27)-(Q11+Q12),0)","v":0},{"$f":"IF(R39<='0 Úvod'!$G$19+'0 Úvod'!$J$19-1,(R26+R27)-(R11+R12),0)","v":0},{"$f":"IF(S39<='0 Úvod'!$G$19+'0 Úvod'!$J$19-1,(S26+S27)-(S11+S12),0)","v":0}]
[null,"J","Redukce provozních dotací - koridory",null,{"$f":"IF(E39<='0 Úvod'!$G$19+'0 Úvod'!$J$19-1,E29-E14,0)","v":0},{"$f":"IF(F39<='0 Úvod'!$G$19+'0 Úvod'!$J$19-1,F29-F14,0)","v":0},{"$f":"IF(G39<='0 Úvod'!$G$19+'0 Úvod'!$J$19-1,G29-G14,0)","v":0},{"$f":"IF(H39<='0 Úvod'!$G$19+'0 Úvod'!$J$19-1,H29-H14,0)","v":0},{"$f":"IF(I39<='0 Úvod'!$G$19+'0 Úvod'!$J$19-1,I29-I14,0)","v":0},{"$f":"IF(J39<='0 Úvod'!$G$19+'0 Úvod'!$J$19-1,J29-J14,0)","v":0},{"$f":"IF(K39<='0 Úvod'!$G$19+'0 Úvod'!$J$19-1,K29-K14,0)","v":0},{"$f":"IF(L39<='0 Úvod'!$G$19+'0 Úvod'!$J$19-1,L29-L14,0)","v":0},{"$f":"IF(M39<='0 Úvod'!$G$19+'0 Úvod'!$J$19-1,M29-M14,0)","v":0},{"$f":"IF(N39<='0 Úvod'!$G$19+'0 Úvod'!$J$19-1,N29-N14,0)","v":0},{"$f":"IF(O39<='0 Úvod'!$G$19+'0 Úvod'!$J$19-1,O29-O14,0)","v":0},{"$f":"IF(P39<='0 Úvod'!$G$19+'0 Úvod'!$J$19-1,P29-P14,0)","v":0},{"$f":"IF(Q39<='0 Úvod'!$G$19+'0 Úvod'!$J$19-1,Q29-Q14,0)","v":0},{"$f":"IF(R39<='0 Úvod'!$G$19+'0 Úvod'!$J$19-1,R29-R14,0)","v":0},{"$f":"IF(S39<='0 Úvod'!$G$19+'0 Úvod'!$J$19-1,S29-S14,0)","v":0}]
[null,null,"Je snížení prov. nákladů plně kompenzováno snížením dotací",null,{"$f":"IF(E42>=E41,\"ANO\",\"NE\")","v":"ANO"},{"$f":"IF(F42>=F41,\"ANO\",\"NE\")","v":"ANO"},"ANO","ANO","ANO","ANO","ANO","ANO","ANO","ANO","ANO","ANO","ANO","ANO","ANO"]
[null,"K","Čistá úspora provozních nákladů**",null,{"$f":"E42-E41","v":0},0,0,0,0,0,0,0,0,0,0,0,0,0,0]
[]
[]
[null,"Komentáře"]
[]
[null,"* tržby hrazené přímo uživateli, v souladu s čl. 61 (Operace, které po dokončení vytvářejí čistý příjem) Nařízení (EU) č. 1303/2013 a přílohou V Nařízení (EU) č. 1303/2013 a oddílem III Nařízení Komise v přenesené pravomoci (EU) č. 480/2014,"]
[null,"   v němž jsou stanovena pravidla pro výpočet diskontovaného čistého příjmu z operací vytvářejících čistý příjem"]
[null,"**rozdíl mezi poklesem provozních nákladů a poklesem provozních dotací"]

{"sheet":"7 Mezera ve financování","index":7,"n_rows":35,"n_cols":19,"rows_kept":35,"cut":false,"hidden":false,"merged":[[11,4,12,4],[11,5,12,5],[11,6,12,6],[11,7,12,7],[11,8,12,8],[11,13,12,13],[11,14,12,14],[11,15,12,15],[11,10,12,10],[11,11,12,11],[27,9,28,18],[25,9,26,18],[1,18,2,18],[1,11,2,11],[1,12,2,12],[1,13,2,13],[1,14,2,14],[1,15,2,15],[1,16,2,16],[23,9,24,18],[22,9,22,18],[11,12,12,12],[11,17,12,17],[11,18,12,18],[11,9,12,9],[11,16,12,16],[1,4,2,4],[1,5,2,5],[1,6,2,6],[1,17,2,17],[1,7,2,7],[1,8,2,8],[1,9,2,9],[1,10,2,10]]}
[null," "]
[null,"7.1.","Kalkulace finanční mezery a přidělení",null,{"$f":"'0 Úvod'!G19","v":2016},{"$f":"E2+1","v":2017},2018,2019,2020,2021,2022,2023,2024,2025,2026,2027,2028,2029,2030]
[null,"a","grantu EU (CZK)","Celkem (disk.)"]
[null,"A","Investiční náklady (DIC) (z FA)",{"$f":"E4+NPV(D9,F4:S4,E14:S14)","v":0},{"$f":"'5 Finanční analýza (FRR_C)'!E7","v":0},{"$f":"'5 Finanční analýza (FRR_C)'!F7","v":0},{"$f":"'5 Finanční analýza (FRR_C)'!G7","v":0},{"$f":"'5 Finanční analýza (FRR_C)'!H7","v":0},{"$f":"'5 Finanční analýza (FRR_C)'!I7","v":0},{"$f":"'5 Finanční analýza (FRR_C)'!J7","v":0},{"$f":"'5 Finanční analýza (FRR_C)'!K7","v":0},{"$f":"'5 Finanční analýza (FRR_C)'!L7","v":0},{"$f":"'5 Finanční analýza (FRR_C)'!M7","v":0},{"$f":"'5 Finanční analýza (FRR_C)'!N7","v":0},{"$f":"'5 Finanční analýza (FRR_C)'!O7","v":0},{"$f":"'5 Finanční analýza (FRR_C)'!P7","v":0},{"$f":"'5 Finanční analýza (FRR_C)'!Q7","v":0},{"$f":"'5 Finanční analýza (FRR_C)'!R7","v":0},{"$f":"'5 Finanční analýza (FRR_C)'!S7","v":0}]
[null,"B","Přírůstkové celkové provozní příjmy**",{"$f":"E5+NPV(D9,F5:S5,E15:S15)","v":0},{"$f":"IF(E2<='0 Úvod'!$G$19+'0 Úvod'!$J$19-1,('4 Tržby'!E34+'4 Tržby'!E35),0)","v":0},{"$f":"IF(F2<='0 Úvod'!$G$19+'0 Úvod'!$J$19-1,('4 Tržby'!F34+'4 Tržby'!F35),0)","v":0},{"$f":"IF(G2<='0 Úvod'!$G$19+'0 Úvod'!$J$19-1,('4 Tržby'!G34+'4 Tržby'!G35),0)","v":0},{"$f":"IF(H2<='0 Úvod'!$G$19+'0 Úvod'!$J$19-1,('4 Tržby'!H34+'4 Tržby'!H35),0)","v":0},{"$f":"IF(I2<='0 Úvod'!$G$19+'0 Úvod'!$J$19-1,('4 Tržby'!I34+'4 Tržby'!I35),0)","v":0},{"$f":"IF(J2<='0 Úvod'!$G$19+'0 Úvod'!$J$19-1,('4 Tržby'!J34+'4 Tržby'!J35),0)","v":0},{"$f":"IF(K2<='0 Úvod'!$G$19+'0 Úvod'!$J$19-1,('4 Tržby'!K34+'4 Tržby'!K35),0)","v":0},{"$f":"IF(L2<='0 Úvod'!$G$19+'0 Úvod'!$J$19-1,('4 Tržby'!L34+'4 Tržby'!L35),0)","v":0},{"$f":"IF(M2<='0 Úvod'!$G$19+'0 Úvod'!$J$19-1,('4 Tržby'!M34+'4 Tržby'!M35),0)","v":0},{"$f":"IF(N2<='0 Úvod'!$G$19+'0 Úvod'!$J$19-1,('4 Tržby'!N34+'4 Tržby'!N35),0)","v":0},{"$f":"IF(O2<='0 Úvod'!$G$19+'0 Úvod'!$J$19-1,('4 Tržby'!O34+'4 Tržby'!O35),0)","v":0},{"$f":"IF(P2<='0 Úvod'!$G$19+'0 Úvod'!$J$19-1,('4 Tržby'!P34+'4 Tržby'!P35),0)","v":0},{"$f":"IF(Q2<='0 Úvod'!$G$19+'0 Úvod'!$J$19-1,('4 Tržby'!Q34+'4 Tržby'!Q35),0)","v":0},{"$f":"IF(R2<='0 Úvod'!$G$19+'0 Úvod'!$J$19-1,('4 Tržby'!R34+'4 Tržby'!R35),0)","v":0},{"$f":"IF(S2<='0 Úvod'!$G$19+'0 Úvod'!$J$19-1,('4 Tržby'!S34+'4 Tržby'!S35),0)","v":0}]
[null,"C","Přírůstkové celkové provozní náklady*",{"$f":"E6+NPV(D9,F6:S6,E16:S16)","v":0},{"$f":"'5 Finanční analýza (FRR_C)'!E6","v":0},{"$f":"'5 Finanční analýza (FRR_C)'!F6","v":0},{"$f":"'5 Finanční analýza (FRR_C)'!G6","v":0},{"$f":"'5 Finanční analýza (FRR_C)'!H6","v":0},{"$f":"'5 Finanční analýza (FRR_C)'!I6","v":0},{"$f":"'5 Finanční analýza (FRR_C)'!J6","v":0},{"$f":"'5 Finanční analýza (FRR_C)'!K6","v":0},{"$f":"'5 Finanční analýza (FRR_C)'!L6","v":0},{"$f":"'5 Finanční analýza (FRR_C)'!M6","v":0},{"$f":"'5 Finanční analýza (FRR_C)'!N6","v":0},{"$f":"'5 Finanční analýza (FRR_C)'!O6","v":0},{"$f":"'5 Finanční analýza (FRR_C)'!P6","v":0},{"$f":"'5 Finanční analýza (FRR_C)'!Q6","v":0},{"$f":"'5 Finanční analýza (FRR_C)'!R6","v":0},{"$f":"'5 Finanční analýza (FRR_C)'!S6","v":0}]
[null,"D","Čisté provozní příjmy",{"$f":"E7+NPV(D9,F7:S7,E17:S17)","v":0},{"$f":"E5-E6","v":0},{"$f":"F5-F6","v":0},0,0,0,0,0,0,0,0,0,0,0,0,0]
[null,"E","Zůstatková hodnota investice",{"$f":"E8+NPV(D9,F8:S8,E18:S18)","v":{"$error":"#DIV/0!"}},{"$f":"IF(E2='0 Úvod'!$G$19+'0 Úvod'!$J$19-1,-1*'2 Zůstatková hodnota'!$I$7,0)","v":0},{"$f":"IF(F2='0 Úvod'!$G$19+'0 Úvod'!$J$19-1,-1*'2 Zůstatková hodnota'!$I$7,0)","v":0},{"$f":"IF(G2='0 Úvod'!$G$19+'0 Úvod'!$J$19-1,-1*'2 Zůstatková hodnota'!$I$7,0)","v":0},{"$f":"IF(H2='0 Úvod'!$G$19+'0 Úvod'!$J$19-1,-1*'2 Zůstatková hodnota'!$I$7,0)","v":0},{"$f":"IF(I2='0 Úvod'!$G$19+'0 Úvod'!$J$19-1,-1*'2 Zůstatková hodnota'!$I$7,0)","v":0},{"$f":"IF(J2='0 Úvod'!$G$19+'0 Úvod'!$J$19-1,-1*'2 Zůstatková hodnota'!$I$7,0)","v":0},{"$f":"IF(K2='0 Úvod'!$G$19+'0 Úvod'!$J$19-1,-1*'2 Zůstatková hodnota'!$I$7,0)","v":0},{"$f":"IF(L2='0 Úvod'!$G$19+'0 Úvod'!$J$19-1,-1*'2 Zůstatková hodnota'!$I$7,0)","v":0},{"$f":"IF(M2='0 Úvod'!$G$19+'0 Úvod'!$J$19-1,-1*'2 Zůstatková hodnota'!$I$7,0)","v":0},{"$f":"IF(N2='0 Úvod'!$G$19+'0 Úvod'!$J$19-1,-1*'2 Zůstatková hodnota'!$I$7,0)","v":0},{"$f":"IF(O2='0 Úvod'!$G$19+'0 Úvod'!$J$19-1,-1*'2 Zůstatková hodnota'!$I$7,0)","v":0},{"$f":"IF(P2='0 Úvod'!$G$19+'0 Úvod'!$J$19-1,-1*'2 Zůstatková hodnota'!$I$7,0)","v":0},{"$f":"IF(Q2='0 Úvod'!$G$19+'0 Úvod'!$J$19-1,-1*'2 Zůstatková hodnota'!$I$7,0)","v":0},{"$f":"IF(R2='0 Úvod'!$G$19+'0 Úvod'!$J$19-1,-1*'2 Zůstatková hodnota'!$I$7,0)","v":0},{"$f":"IF(S2='0 Úvod'!$G$19+'0 Úvod'!$J$19-1,-1*'2 Zůstatková hodnota'!$I$7,0)","v":0}]
[null,null,"Diskontní faktor",{"$f":"'0 Úvod'!D21","v":0.04},1,{"$f":"1/(1+$D$9)","v":0.96153846153846145},{"$f":"F9/(1+$D$9)","v":0.92455621301775137},{"$f":"G9/(1+$D$9)","v":0.88899635867091475},0.85480419102972571,0.82192710675935166,0.79031452573014582,0.75991781320206331,0.73069020500198389,0.70258673557883067,0.67556416882579873,0.64958093156326802,0.62459704958006534,0.60057408613467822,0.57747508282180593]
[null,"F","Úspora provozních nákladů*",{"$f":"IF((E10+NPV(D9,F10:S10,E20:S20))<=0,0,IF(('6 Kontrola dotací'!E35+NPV(D9,'6 Kontrola dotací'!F35:AC35,'6 Kontrola dotací'!E42:AC42))>=(E10+NPV(D9,F10:S10,E20:S20)),0,-(E10+NPV(D9,F10:S10,E20:S20))+('6 Kontrola dotací'!E35+NPV(D9,'6 Kontrola dotací'!F35:AC35,'6 Kontrola dotací'!E42:AC42))))","v":0},{"$f":"IF(E2<='0 Úvod'!$G$19+'0 Úvod'!$J$19-1,'6 Kontrola dotací'!E34,0)","v":0},{"$f":"IF(F2<='0 Úvod'!$G$19+'0 Úvod'!$J$19-1,'6 Kontrola dotací'!F34,0)","v":0},{"$f":"IF(G2<='0 Úvod'!$G$19+'0 Úvod'!$J$19-1,'6 Kontrola dotací'!G34,0)","v":0},{"$f":"IF(H2<='0 Úvod'!$G$19+'0 Úvod'!$J$19-1,'6 Kontrola dotací'!H34,0)","v":0},{"$f":"IF(I2<='0 Úvod'!$G$19+'0 Úvod'!$J$19-1,'6 Kontrola dotací'!I34,0)","v":0},{"$f":"IF(J2<='0 Úvod'!$G$19+'0 Úvod'!$J$19-1,'6 Kontrola dotací'!J34,0)","v":0},{"$f":"IF(K2<='0 Úvod'!$G$19+'0 Úvod'!$J$19-1,'6 Kontrola dotací'!K34,0)","v":0},{"$f":"IF(L2<='0 Úvod'!$G$19+'0 Úvod'!$J$19-1,'6 Kontrola dotací'!L34,0)","v":0},{"$f":"IF(M2<='0 Úvod'!$G$19+'0 Úvod'!$J$19-1,'6 Kontrola dotací'!M34,0)","v":0},{"$f":"IF(N2<='0 Úvod'!$G$19+'0 Úvod'!$J$19-1,'6 Kontrola dotací'!N34,0)","v":0},{"$f":"IF(O2<='0 Úvod'!$G$19+'0 Úvod'!$J$19-1,'6 Kontrola dotací'!O34,0)","v":0},{"$f":"IF(P2<='0 Úvod'!$G$19+'0 Úvod'!$J$19-1,'6 Kontrola dotací'!P34,0)","v":0},{"$f":"IF(Q2<='0 Úvod'!$G$19+'0 Úvod'!$J$19-1,'6 Kontrola dotací'!Q34,0)","v":0},{"$f":"IF(R2<='0 Úvod'!$G$19+'0 Úvod'!$J$19-1,'6 Kontrola dotací'!R34,0)","v":0},{"$f":"IF(S2<='0 Úvod'!$G$19+'0 Úvod'!$J$19-1,'6 Kontrola dotací'!S34,0)","v":0}]
[]
[null,"7.1.","Kalkulace finanční mezery a přidělení",null,{"$f":"S2+1","v":2031},{"$f":"E12+1","v":2032},2033,2034,2035,2036,2037,2038,2039,2040,2041,2042,2043,2044,2045]
[null,"b","grantu EU (CZK)"]
[null,"A","Investiční náklady (DIC) (z FA)",null,{"$f":"'5 Finanční analýza (FRR_C)'!E19","v":0},{"$f":"'5 Finanční analýza (FRR_C)'!F19","v":0},{"$f":"'5 Finanční analýza (FRR_C)'!G19","v":0},{"$f":"'5 Finanční analýza (FRR_C)'!H19","v":0},{"$f":"'5 Finanční analýza (FRR_C)'!I19","v":0},{"$f":"'5 Finanční analýza (FRR_C)'!J19","v":0},{"$f":"'5 Finanční analýza (FRR_C)'!K19","v":0},{"$f":"'5 Finanční analýza (FRR_C)'!L19","v":0},{"$f":"'5 Finanční analýza (FRR_C)'!M19","v":0},{"$f":"'5 Finanční analýza (FRR_C)'!N19","v":0},{"$f":"'5 Finanční analýza (FRR_C)'!O19","v":0},{"$f":"'5 Finanční analýza (FRR_C)'!P19","v":0},{"$f":"'5 Finanční analýza (FRR_C)'!Q19","v":0},{"$f":"'5 Finanční analýza (FRR_C)'!R19","v":0},{"$f":"'5 Finanční analýza (FRR_C)'!S19","v":0}]
[null,"B","Přírůstkové celkové provozní příjmy**",null,{"$f":"IF(E12<='0 Úvod'!$G$19+'0 Úvod'!$J$19-1,('4 Tržby'!E41+'4 Tržby'!E42),0)","v":0},{"$f":"IF(F12<='0 Úvod'!$G$19+'0 Úvod'!$J$19-1,('4 Tržby'!F41+'4 Tržby'!F42),0)","v":0},{"$f":"IF(G12<='0 Úvod'!$G$19+'0 Úvod'!$J$19-1,('4 Tržby'!G41+'4 Tržby'!G42),0)","v":0},{"$f":"IF(H12<='0 Úvod'!$G$19+'0 Úvod'!$J$19-1,('4 Tržby'!H41+'4 Tržby'!H42),0)","v":0},{"$f":"IF(I12<='0 Úvod'!$G$19+'0 Úvod'!$J$19-1,('4 Tržby'!I41+'4 Tržby'!I42),0)","v":0},{"$f":"IF(J12<='0 Úvod'!$G$19+'0 Úvod'!$J$19-1,('4 Tržby'!J41+'4 Tržby'!J42),0)","v":0},{"$f":"IF(K12<='0 Úvod'!$G$19+'0 Úvod'!$J$19-1,('4 Tržby'!K41+'4 Tržby'!K42),0)","v":0},{"$f":"IF(L12<='0 Úvod'!$G$19+'0 Úvod'!$J$19-1,('4 Tržby'!L41+'4 Tržby'!L42),0)","v":0},{"$f":"IF(M12<='0 Úvod'!$G$19+'0 Úvod'!$J$19-1,('4 Tržby'!M41+'4 Tržby'!M42),0)","v":0},{"$f":"IF(N12<='0 Úvod'!$G$19+'0 Úvod'!$J$19-1,('4 Tržby'!N41+'4 Tržby'!N42),0)","v":0},{"$f":"IF(O12<='0 Úvod'!$G$19+'0 Úvod'!$J$19-1,('4 Tržby'!O41+'4 Tržby'!O42),0)","v":0},{"$f":"IF(P12<='0 Úvod'!$G$19+'0 Úvod'!$J$19-1,('4 Tržby'!P41+'4 Tržby'!P42),0)","v":0},{"$f":"IF(Q12<='0 Úvod'!$G$19+'0 Úvod'!$J$19-1,('4 Tržby'!Q41+'4 Tržby'!Q42),0)","v":0},{"$f":"IF(R12<='0 Úvod'!$G$19+'0 Úvod'!$J$19-1,('4 Tržby'!R41+'4 Tržby'!R42),0)","v":0},{"$f":"IF(S12<='0 Úvod'!$G$19+'0 Úvod'!$J$19-1,('4 Tržby'!S41+'4 Tržby'!S42),0)","v":0}]
[null,"C","Přírůstkové celkové provozní náklady*",null,{"$f":"'5 Finanční analýza (FRR_C)'!E18","v":0},{"$f":"'5 Finanční analýza (FRR_C)'!F18","v":0},{"$f":"'5 Finanční analýza (FRR_C)'!G18","v":0},{"$f":"'5 Finanční analýza (FRR_C)'!H18","v":0},{"$f":"'5 Finanční analýza (FRR_C)'!I18","v":0},{"$f":"'5 Finanční analýza (FRR_C)'!J18","v":0},{"$f":"'5 Finanční analýza (FRR_C)'!K18","v":0},{"$f":"'5 Finanční analýza (FRR_C)'!L18","v":0},{"$f":"'5 Finanční analýza (FRR_C)'!M18","v":0},{"$f":"'5 Finanční analýza (FRR_C)'!N18","v":0},{"$f":"'5 Finanční analýza (FRR_C)'!O18","v":0},{"$f":"'5 Finanční analýza (FRR_C)'!P18","v":0},{"$f":"'5 Finanční analýza (FRR_C)'!Q18","v":0},{"$f":"'5 Finanční analýza (FRR_C)'!R18","v":0},{"$f":"'5 Finanční analýza (FRR_C)'!S18","v":0}]
[null,"D","Čisté provozní příjmy",null,{"$f":"E15-E16","v":0},{"$f":"F15-F16","v":0},0,0,0,0,0,0,0,0,0,0,0,0,0]
[null,"E","Zůstatková hodnota investice",null,{"$f":"IF(E12='0 Úvod'!$G$19+'0 Úvod'!$J$19-1,-1*'2 Zůstatková hodnota'!$I$7,0)","v":0},{"$f":"IF(F12='0 Úvod'!$G$19+'0 Úvod'!$J$19-1,-1*'2 Zůstatková hodnota'!$I$7,0)","v":0},{"$f":"IF(G12='0 Úvod'!$G$19+'0 Úvod'!$J$19-1,-1*'2 Zůstatková hodnota'!$I$7,0)","v":0},{"$f":"IF(H12='0 Úvod'!$G$19+'0 Úvod'!$J$19-1,-1*'2 Zůstatková hodnota'!$I$7,0)","v":0},{"$f":"IF(I12='0 Úvod'!$G$19+'0 Úvod'!$J$19-1,-1*'2 Zůstatková hodnota'!$I$7,0)","v":0},{"$f":"IF(J12='0 Úvod'!$G$19+'0 Úvod'!$J$19-1,-1*'2 Zůstatková hodnota'!$I$7,0)","v":0},{"$f":"IF(K12='0 Úvod'!$G$19+'0 Úvod'!$J$19-1,-1*'2 Zůstatková hodnota'!$I$7,0)","v":0},{"$f":"IF(L12='0 Úvod'!$G$19+'0 Úvod'!$J$19-1,-1*'2 Zůstatková hodnota'!$I$7,0)","v":0},{"$f":"IF(M12='0 Úvod'!$G$19+'0 Úvod'!$J$19-1,-1*'2 Zůstatková hodnota'!$I$7,0)","v":0},{"$f":"IF(N12='0 Úvod'!$G$19+'0 Úvod'!$J$19-1,-1*'2 Zůstatková hodnota'!$I$7,0)","v":0},{"$f":"IF(O12='0 Úvod'!$G$19+'0 Úvod'!$J$19-1,-1*'2 Zůstatková hodnota'!$I$7,0)","v":0},{"$f":"IF(P12='0 Úvod'!$G$19+'0 Úvod'!$J$19-1,-1*'2 Zůstatková hodnota'!$I$7,0)","v":0},{"$f":"IF(Q12='0 Úvod'!$G$19+'0 Úvod'!$J$19-1,-1*'2 Zůstatková hodnota'!$I$7,0)","v":0},{"$f":"IF(R12='0 Úvod'!$G$19+'0 Úvod'!$J$19-1,-1*'2 Zůstatková hodnota'!$I$7,0)","v":0},{"$f":"IF(S12='0 Úvod'!$G$19+'0 Úvod'!$J$19-1,-1*'2 Zůstatková hodnota'!$I$7,0)","v":{"$error":"#DIV/0!"}}]
[null,null,"Diskontní faktor",{"$f":"D9","v":0.04},{"$f":"S9/(1+$D$9)","v":0.55526450271327488},{"$f":"E19/(1+$D$9)","v":0.53390817568584126},{"$f":"F19/(1+$D$9)","v":0.51337324585177047},0.49362812101131776,0.47464242404934398,0.45638694620129228,0.4388336021166272,0.42195538665060306,0.40572633331788754,0.39012147434412264,0.37511680225396404,0.3606892329365039,0.34681657013125372,0.33347747128005162,0.32065141469235731]
[null,"F","Úspora provozních nákladů*",null,{"$f":"IF(E12<='0 Úvod'!$G$19+'0 Úvod'!$J$19-1,'6 Kontrola dotací'!E41,0)","v":0},{"$f":"IF(F12<='0 Úvod'!$G$19+'0 Úvod'!$J$19-1,'6 Kontrola dotací'!F41,0)","v":0},{"$f":"IF(G12<='0 Úvod'!$G$19+'0 Úvod'!$J$19-1,'6 Kontrola dotací'!G41,0)","v":0},{"$f":"IF(H12<='0 Úvod'!$G$19+'0 Úvod'!$J$19-1,'6 Kontrola dotací'!H41,0)","v":0},{"$f":"IF(I12<='0 Úvod'!$G$19+'0 Úvod'!$J$19-1,'6 Kontrola dotací'!I41,0)","v":0},{"$f":"IF(J12<='0 Úvod'!$G$19+'0 Úvod'!$J$19-1,'6 Kontrola dotací'!J41,0)","v":0},{"$f":"IF(K12<='0 Úvod'!$G$19+'0 Úvod'!$J$19-1,'6 Kontrola dotací'!K41,0)","v":0},{"$f":"IF(L12<='0 Úvod'!$G$19+'0 Úvod'!$J$19-1,'6 Kontrola dotací'!L41,0)","v":0},{"$f":"IF(M12<='0 Úvod'!$G$19+'0 Úvod'!$J$19-1,'6 Kontrola dotací'!M41,0)","v":0},{"$f":"IF(N12<='0 Úvod'!$G$19+'0 Úvod'!$J$19-1,'6 Kontrola dotací'!N41,0)","v":0},{"$f":"IF(O12<='0 Úvod'!$G$19+'0 Úvod'!$J$19-1,'6 Kontrola dotací'!O41,0)","v":0},{"$f":"IF(P12<='0 Úvod'!$G$19+'0 Úvod'!$J$19-1,'6 Kontrola dotací'!P41,0)","v":0},{"$f":"IF(Q12<='0 Úvod'!$G$19+'0 Úvod'!$J$19-1,'6 Kontrola dotací'!Q41,0)","v":0},{"$f":"IF(R12<='0 Úvod'!$G$19+'0 Úvod'!$J$19-1,'6 Kontrola dotací'!R41,0)","v":0},{"$f":"IF(S12<='0 Úvod'!$G$19+'0 Úvod'!$J$19-1,'6 Kontrola dotací'!S41,0)","v":0}]
[]
[]
[null,"7.2.","Kalkulace veřejného příspěvku (CZK) - stálé ceny",null,null,null,"CZK","EUR",null,"Komentáře"]
[null,null,"Způsobilé náklady***",null,null,null,{"$f":"'1 Celkové investiční náklady'!F11*('1 Celkové investiční náklady'!E45/'1 Celkové investiční náklady'!F45)","v":{"$error":"#DIV/0!"}},{"$f":"G24/'0 Úvod'!N19","v":{"$error":"#DIV/0!"}},null,"* v případě vynechání dle čl. 61 Nařízení (EU) č. 1303/2013, musí být poskytnuta ukázka úměrného snížení dotací na základě shody s hodnotami cash-flow z tabulky \"Provozní náklady\""]
[null,null,"Míra finanční mezery ((DIC bez rezervy- čisté příjmy)/DIC bez rezervy)",null,null,null,{"$f":"IF(D6>D5,1,IF(D6>0,ROUND((D4-(D5-D6)*('1 Celkové investiční náklady'!$E$45/'1 Celkové investiční náklady'!$F$45)+D8*('1 Celkové investiční náklady'!$E$45/'1 Celkové investiční náklady'!$F$45))/D4,4),IF(ROUND((D4-(D5-D10)*('1 Celkové investiční náklady'!$E$45/'1 Celkové investiční náklady'!$F$45)+D8*('1 Celkové investiční náklady'!$E$45/'1 Celkové investiční náklady'!$F$45))/D4,4)>1,1,ROUND((D4-(D5-D10)*('1 Celkové investiční náklady'!$E$45/'1 Celkové investiční náklady'!$F$45)+D8*('1 Celkové investiční náklady'!$E$45/'1 Celkové investiční náklady'!$F$45))/D4,4))))","v":{"$error":"#DIV/0!"}}]
[null,null,"Rozhodná částka (způsobilé náklady*R)",null,null,null,{"$f":"ROUND(G24*G25,0)","v":{"$error":"#DIV/0!"}},{"$f":"G26/'0 Úvod'!N19","v":{"$error":"#DIV/0!"}},null,"** tržby hrazené přímo uživateli,  čl. 61 Nařízení (EU) č. 1303/2013 a příloha V Nařízení (EU) č. 1303/2013 a oddíl III Nařízení Komise v přenesené pravomoci (EU) č. 480/2014"]
[null,null,"Míra spolufinancování prioritních os (%)",null,null,null,0.85]
[null,null,"Příspěvek Společenství",null,null,null,{"$f":"FLOOR(G26*G27,1)","v":{"$error":"#DIV/0!"}},{"$f":"G28/'0 Úvod'!N19","v":{"$error":"#DIV/0!"}},null,"*** jedná se o procentuální odhad způsobilých nákladů ve stálých cenách, který vychází ze skutečného poměru způsobilých a nezpůsobilých nákladů v běžných cenách z tabulky způsobilosti nákladů (list \"1 Celkové investiční náklady\" tabulka 1.2)"]
[]
[null,"7.3.","Kalkulace veřejného příspěvku (CZK) - běžné ceny",null,null,null,"CZK","EUR"]
[null,null,"Způsobilé náklady",null,null,null,{"$f":"'1 Celkové investiční náklady'!E45","v":0},{"$f":"G31/'0 Úvod'!N19","v":0}]
[null,null,"Míra finanční mezery ((DIC bez rezervy- čisté příjmy)/DIC bez rezervy)",null,null,null,{"$f":"G25","v":{"$error":"#DIV/0!"}}]
[null,null,"Rozhodná částka (způsobilé náklady*R)",null,null,null,{"$f":"ROUND(G31*G32,0)","v":{"$error":"#DIV/0!"}},{"$f":"G33/'0 Úvod'!N19","v":{"$error":"#DIV/0!"}}]
[null,null,"Míra spolufinancování prioritních os (%)",null,null,null,{"$f":"G27","v":0.85}]
[null,null,"Příspěvek Společenství",null,null,null,{"$f":"FLOOR(G33*G34,2)","v":{"$error":"#DIV/0!"}},{"$f":"G35/'0 Úvod'!N19","v":{"$error":"#DIV/0!"}}]

{"sheet":"8 Finanční struktura","index":8,"n_rows":65,"n_cols":20,"rows_kept":65,"cut":false,"hidden":false,"merged":[[1,19,2,19],[32,19,33,19],[47,18,48,18],[16,18,17,18],[62,1,63,3],[47,4,48,4],[47,5,48,5],[47,6,48,6],[47,7,48,7],[47,8,48,8],[47,9,48,9],[47,10,48,10],[47,11,48,11],[16,4,17,4],[16,5,17,5],[16,6,17,6],[1,18,2,18],[1,4,2,4],[1,5,2,5],[1,6,2,6],[1,7,2,7],[1,10,2,10],[1,11,2,11],[1,12,2,12],[1,13,2,13],[1,17,2,17],[16,14,17,14],[16,15,17,15],[16,16,17,16],[16,17,17,17],[1,14,2,14],[1,15,2,15],[1,16,2,16],[16,13,17,13],[1,8,2,8],[1,9,2,9],[32,4,33,4],[32,5,33,5],[32,6,33,6],[32,7,33,7],[16,7,17,7],[16,8,17,8],[16,9,17,9],[16,10,17,10],[16,11,17,11],[16,12,17,12],[32,18,33,18],[32,8,33,8],[32,9,33,9],[32,10,33,10],[32,11,33,11],[32,13,33,13],[32,12,33,12],[47,17,48,17],[32,14,33,14],[32,15,33,15],[32,16,33,16],[32,17,33,17],[47,13,48,13],[47,12,48,12],[47,14,48,14],[47,15,48,15],[47,16,48,16]]}
[]
[null,"8.1.","Zdroje financování investičních nákladů (CZK)",{"$f":"'0 Úvod'!D19","v":2016},{"$f":"'0 Úvod'!G19","v":2016},{"$f":"E2+1","v":2017},2018,2019,{"$f":"H2+1","v":2020},2021,2022,2023,2024,2025,2026,2027,2028,2029,2030,"Kontrolní suma*"]
[null,"a","Konstantní ceny","Celkem"]
[null,null,"Vlastní zdroje",{"$f":"SUM(E4:S4,E19:S19)","v":0}]
[null,null,"Ostatní zdroje",{"$f":"SUM(E5:S5,E20:S20)","v":0}]
[null,null,"Celkové zdroje žadatele",0,{"$f":"E5+E4","v":0},0,0,0,0,0,0,0,0,0,{"$f":"O5+O4","v":0},0,0,0,{"$f":"S5+S4","v":0}]
[null,null,"Úvěr (poskytnutý státní správou)",0]
[null,null,"Zdroje státního rozpočtu",0]
[null,null,"Národní zdroje",0,{"$f":"E8+E7","v":0},0,0,0,0,0,0,0,0,0,0,0,0,0,{"$f":"S8+S7","v":0}]
[null,null,"Granty EU",0]
[null,null,"Celkové finanční zdroje (bez rezervy) ",0,{"$f":"E6+E9+E10","v":0},{"$f":"F6+F9+F10","v":0},{"$f":"G6+G9+G10","v":0},0,0,0,0,0,0,0,0,0,0,0,{"$f":"S6+S9+S10","v":0},{"$f":"IF(D11='1 Celkové investiční náklady'!F11,\"OK\",\"CHYBA!\")","v":"OK"}]
[null,null,"Rezerva - vlastní zdroje",0]
[null,null,"Rezerva - EU granty",0]
[null,null,"Rezerva celkem",0,{"$f":"E12+E13","v":0},{"$f":"F12+F13","v":0},{"$f":"G12+G13","v":0},{"$f":"H12+H13","v":0},{"$f":"I12+I13","v":0},0,0,0,0,0,0,0,0,0,{"$f":"S12+S13","v":0}]
[null,null,"Celkové finanční zdroje",0,{"$f":"E11+E14","v":0},{"$f":"F11+F14","v":0},{"$f":"G11+G14","v":0},{"$f":"H11+H14","v":0},{"$f":"I11+I14","v":0},0,0,0,0,0,0,0,0,0,{"$f":"S11+S14","v":0},{"$f":"IF(D15='1 Celkové investiční náklady'!F13,\"OK\",\"CHYBA!\")","v":"OK"}]
[]
[null,"8.1.","Zdroje financování investičních nákladů  (CZK)",{"$f":"D2","v":2016},{"$f":"S2+1","v":2031},{"$f":"E17+1","v":2032},2033,2034,{"$f":"H17+1","v":2035},2036,2037,2038,2039,2040,2041,2042,2043,2044,2045]
[null,"b","Konstantní ceny"]
[null,null,"Vlastní zdroje"]
[null,null,"Ostatní zdroje"]
[null,null,"Celkové zdroje žadatele",null,{"$f":"E20+E19","v":0},0,0,0,0,0,0,0,0,0,0,0,0,0,{"$f":"S20+S19","v":0}]
[null,null,"Úvěr (poskytnutý státní správou)"]
[null,null,"Zdroje státního rozpočtu"]
[null,null,"Národní zdroje",null,{"$f":"E23+E22","v":0},0,0,0,0,0,0,0,0,0,0,0,0,0,{"$f":"S23+S22","v":0}]
[null,null,"Granty EU"]
[null,null,"Celkové finanční zdroje (bez rezervy) ",null,{"$f":"E21+E24+E25","v":0},0,0,0,0,0,0,0,0,0,0,0,0,0,{"$f":"S21+S24+S25","v":0}]
[null,null,"Rezerva - vlastní zdroje"]
[null,null,"Rezerva - EU granty"]
[null,null,"Rezerva celkem",null,{"$f":"E27+E28","v":0},{"$f":"F27+F28","v":0},{"$f":"G27+G28","v":0},{"$f":"H27+H28","v":0},{"$f":"I27+I28","v":0},0,0,0,0,0,0,0,0,0,{"$f":"S27+S28","v":0}]
[null,null,"Celkové finanční zdroje",null,{"$f":"E26+E29","v":0},{"$f":"F26+F29","v":0},{"$f":"G26+G29","v":0},{"$f":"H26+H29","v":0},{"$f":"I26+I29","v":0},0,0,0,0,0,0,0,0,0,{"$f":"S26+S29","v":0}]
[]
[]
[null,"8.2.","Zdroje financování investičních nákladů  (CZK)",null,{"$f":"E2","v":2016},{"$f":"E33+1","v":2017},2018,2019,{"$f":"H33+1","v":2020},2021,2022,2023,2024,2025,2026,2027,2028,2029,2030,"Kontrolní suma*"]
[null,"a","Běžné ceny","Celkem"]
[null,null,"Vlastní zdroje",{"$f":"SUM(E35:S35,E50:S50)","v":0}]
[null,null,"Ostatní zdroje",{"$f":"SUM(E36:S36,E51:S51)","v":0}]
[null,null,"Celkové zdroje žadatele",0,{"$f":"E36+E35","v":0},{"$f":"F36+F35","v":0},{"$f":"G36+G35","v":0},{"$f":"H36+H35","v":0},{"$f":"I36+I35","v":0},0,0,0,0,0,0,0,0,0,{"$f":"S36+S35","v":0}]
[null,null,"Úvěr (poskytnutý státní správou)",0]
[null,null,"Zdroje státního rozpočtu",0]
[null,null,"Národní zdroje",0,{"$f":"E39+E38","v":0},{"$f":"F39+F38","v":0},{"$f":"G39+G38","v":0},{"$f":"H39+H38","v":0},{"$f":"I39+I38","v":0},0,0,0,0,0,0,0,0,0,{"$f":"S39+S38","v":0}]
[null,null,"Granty EU",0]
[null,null,"Celkové finanční zdroje (bez rezervy) ",0,{"$f":"E37+E40+E41","v":0},{"$f":"F37+F40+F41","v":0},{"$f":"G37+G40+G41","v":0},{"$f":"H37+H40+H41","v":0},{"$f":"I37+I40+I41","v":0},0,0,0,0,0,0,0,0,0,{"$f":"S37+S40+S41","v":0},{"$f":"IF(D42=('1 Celkové investiční náklady'!F45-'1 Celkové investiční náklady'!F40),\"OK\",\"CHYBA!\")","v":"OK"}]
[null,null,"Rezerva - vlastní zdroje",0]
[null,null,"Rezerva - EU granty",0]
[null,null,"Rezerva celkem",0,{"$f":"E43+E44","v":0},{"$f":"F43+F44","v":0},{"$f":"G43+G44","v":0},{"$f":"H43+H44","v":0},{"$f":"I43+I44","v":0},0,0,0,0,0,0,0,0,0,{"$f":"S43+S44","v":0}]
[null,null,"Celkové finanční zdroje",0,{"$f":"E42+E45","v":0},{"$f":"F42+F45","v":0},{"$f":"G42+G45","v":0},{"$f":"H42+H45","v":0},{"$f":"I42+I45","v":0},0,0,0,0,0,0,0,0,0,{"$f":"S42+S45","v":0},{"$f":"IF(D46='1 Celkové investiční náklady'!F45,\"OK\",\"CHYBA!\")","v":"OK"}]
[]
[null,"8.2.","Zdroje financování investičních nákladů  (CZK)",null,{"$f":"E17","v":2031},{"$f":"E48+1","v":2032},2033,2034,{"$f":"H48+1","v":2035},2036,2037,2038,2039,2040,2041,2042,2043,2044,2045]
[null,"b","Běžné ceny"]
[null,null,"Vlastní zdroje"]
[null,null,"Ostatní zdroje"]
[null,null,"Celkové zdroje žadatele",null,{"$f":"E51+E50","v":0},{"$f":"F51+F50","v":0},{"$f":"G51+G50","v":0},{"$f":"H51+H50","v":0},{"$f":"I51+I50","v":0},0,0,0,0,0,0,0,0,0,{"$f":"S51+S50","v":0}]
[null,null,"Úvěr (poskytnutý státní správou)"]
[null,null,"Zdroje státního rozpočtu"]
[null,null,"Národní zdroje",null,{"$f":"E54+E53","v":0},{"$f":"F54+F53","v":0},{"$f":"G54+G53","v":0},{"$f":"H54+H53","v":0},{"$f":"I54+I53","v":0},0,0,0,0,0,0,0,0,0,{"$f":"S54+S53","v":0}]
[null,null,"Granty EU"]
[null,null,"Celkové finanční zdroje (bez rezervy) ",null,{"$f":"E52+E55+E56","v":0},{"$f":"F52+F55+F56","v":0},{"$f":"G52+G55+G56","v":0},{"$f":"H52+H55+H56","v":0},{"$f":"I52+I55+I56","v":0},0,0,0,0,0,0,0,0,0,{"$f":"S52+S55+S56","v":0}]
[null,null,"Rezerva - vlastní zdroje"]
[null,null,"Rezerva - EU granty"]
[null,null,"Rezerva celkem",null,{"$f":"E58+E59","v":0},{"$f":"F58+F59","v":0},{"$f":"G58+G59","v":0},{"$f":"H58+H59","v":0},{"$f":"I58+I59","v":0},0,0,0,0,0,0,0,0,0,{"$f":"S58+S59","v":0}]
[null,null,"Celkové finanční zdroje",null,{"$f":"E57+E60","v":0},{"$f":"F57+F60","v":0},{"$f":"G57+G60","v":0},{"$f":"H57+H60","v":0},{"$f":"I57+I60","v":0},0,0,0,0,0,0,0,0,0,{"$f":"S57+S60","v":0}]
[]
[null,"Komentáře"]
[]
[null,"* kontrola souladu celk. finančních zdrojů s celk. investičními náklady"]

{"sheet":"9 Udržitelnost","index":9,"n_rows":34,"n_cols":19,"rows_kept":34,"cut":false,"hidden":false,"merged":[[18,18,19,18],[18,13,19,13],[18,14,19,14],[18,15,19,15],[18,16,19,16],[18,9,19,9],[18,10,19,10],[18,11,19,11],[18,12,19,12],[18,17,19,17],[18,4,19,4],[18,5,19,5],[18,6,19,6],[18,7,19,7],[18,8,19,8],[1,16,2,16],[1,17,2,17],[1,14,2,14],[1,15,2,15],[1,18,2,18],[1,9,2,9],[1,10,2,10],[1,11,2,11],[1,12,2,12],[1,13,2,13],[1,4,2,4],[1,5,2,5],[1,6,2,6],[1,7,2,7],[1,8,2,8]]}
[" "]
[null,"9.1.","Udržitelnost projektu (CZK)",null,{"$f":"'0 Úvod'!G19","v":2016},{"$f":"E2+1","v":2017},2018,2019,2020,2021,2022,2023,2024,2025,2026,2027,2028,2029,2030]
[null,"a","Stálé ceny","Total"]
[null,null,"Provozní příjmy",{"$f":"SUM(E4:S4,E21:S21)","v":0},{"$f":"'4 Tržby'!E7","v":0},{"$f":"'4 Tržby'!F7","v":0},{"$f":"'4 Tržby'!G7","v":0},{"$f":"'4 Tržby'!H7","v":0},{"$f":"'4 Tržby'!I7","v":0},{"$f":"'4 Tržby'!J7","v":0},{"$f":"'4 Tržby'!K7","v":0},{"$f":"'4 Tržby'!L7","v":0},{"$f":"'4 Tržby'!M7","v":0},{"$f":"'4 Tržby'!N7","v":0},{"$f":"'4 Tržby'!O7","v":0},{"$f":"'4 Tržby'!P7","v":0},{"$f":"'4 Tržby'!Q7","v":0},{"$f":"'4 Tržby'!R7","v":0},{"$f":"'4 Tržby'!S7","v":0}]
[null,null,"Úvěry",{"$f":"SUM(E5:S5,E22:S22)","v":0},{"$f":"'8 Finanční struktura'!E7","v":0},{"$f":"'8 Finanční struktura'!F7","v":0},{"$f":"'8 Finanční struktura'!G7","v":0},{"$f":"'8 Finanční struktura'!H7","v":0},{"$f":"'8 Finanční struktura'!I7","v":0},{"$f":"'8 Finanční struktura'!J7","v":0},{"$f":"'8 Finanční struktura'!K7","v":0},{"$f":"'8 Finanční struktura'!L7","v":0},{"$f":"'8 Finanční struktura'!M7","v":0},{"$f":"'8 Finanční struktura'!N7","v":0},{"$f":"'8 Finanční struktura'!O7","v":0},{"$f":"'8 Finanční struktura'!P7","v":0},{"$f":"'8 Finanční struktura'!Q7","v":0},{"$f":"'8 Finanční struktura'!R7","v":0},{"$f":"'8 Finanční struktura'!S7","v":0}]
[" ",null,"Celkové zdroje žadatele",0,{"$f":"'8 Finanční struktura'!E6","v":0},{"$f":"'8 Finanční struktura'!F6","v":0},{"$f":"'8 Finanční struktura'!G6","v":0},{"$f":"'8 Finanční struktura'!H6","v":0},{"$f":"'8 Finanční struktura'!I6","v":0},{"$f":"'8 Finanční struktura'!J6","v":0},{"$f":"'8 Finanční struktura'!K6","v":0},{"$f":"'8 Finanční struktura'!L6","v":0},{"$f":"'8 Finanční struktura'!M6","v":0},{"$f":"'8 Finanční struktura'!N6","v":0},{"$f":"'8 Finanční struktura'!O6","v":0},{"$f":"'8 Finanční struktura'!P6","v":0},{"$f":"'8 Finanční struktura'!Q6","v":0},{"$f":"'8 Finanční struktura'!R6","v":0},{"$f":"'8 Finanční struktura'!S6","v":0}]
[" ",null,"Zdroje státního rozpočtu",0,{"$f":"'8 Finanční struktura'!E8","v":0},{"$f":"'8 Finanční struktura'!F8","v":0},{"$f":"'8 Finanční struktura'!G8","v":0},{"$f":"'8 Finanční struktura'!H8","v":0},{"$f":"'8 Finanční struktura'!I8","v":0},{"$f":"'8 Finanční struktura'!J8","v":0},{"$f":"'8 Finanční struktura'!K8","v":0},{"$f":"'8 Finanční struktura'!L8","v":0},{"$f":"'8 Finanční struktura'!M8","v":0},{"$f":"'8 Finanční struktura'!N8","v":0},{"$f":"'8 Finanční struktura'!O8","v":0},{"$f":"'8 Finanční struktura'!P8","v":0},{"$f":"'8 Finanční struktura'!Q8","v":0},{"$f":"'8 Finanční struktura'!R8","v":0},{"$f":"'8 Finanční struktura'!S8","v":0}]
[" ",null,"Granty EU",0,{"$f":"'8 Finanční struktura'!E10","v":0},{"$f":"'8 Finanční struktura'!F10","v":0},{"$f":"'8 Finanční struktura'!G10","v":0},{"$f":"'8 Finanční struktura'!H10","v":0},{"$f":"'8 Finanční struktura'!I10","v":0},{"$f":"'8 Finanční struktura'!J10","v":0},{"$f":"'8 Finanční struktura'!K10","v":0},{"$f":"'8 Finanční struktura'!L10","v":0},{"$f":"'8 Finanční struktura'!M10","v":0},{"$f":"'8 Finanční struktura'!N10","v":0},{"$f":"'8 Finanční struktura'!O10","v":0},{"$f":"'8 Finanční struktura'!P10","v":0},{"$f":"'8 Finanční struktura'!Q10","v":0},{"$f":"'8 Finanční struktura'!R10","v":0},{"$f":"'8 Finanční struktura'!S10","v":0}]
[null,null,"Dotace",0,{"$f":"'6 Kontrola dotací'!E7","v":0},{"$f":"'6 Kontrola dotací'!F7","v":0},{"$f":"'6 Kontrola dotací'!G7","v":0},{"$f":"'6 Kontrola dotací'!H7","v":0},{"$f":"'6 Kontrola dotací'!I7","v":0},{"$f":"'6 Kontrola dotací'!J7","v":0},{"$f":"'6 Kontrola dotací'!K7","v":0},{"$f":"'6 Kontrola dotací'!L7","v":0},{"$f":"'6 Kontrola dotací'!M7","v":0},{"$f":"'6 Kontrola dotací'!N7","v":0},{"$f":"'6 Kontrola dotací'!O7","v":0},{"$f":"'6 Kontrola dotací'!P7","v":0},{"$f":"'6 Kontrola dotací'!Q7","v":0},{"$f":"'6 Kontrola dotací'!R7","v":0},{"$f":"'6 Kontrola dotací'!S7","v":0}]
[null,null,"Celkové příjmy",0,{"$f":"SUM(E4:E9)","v":0},{"$f":"SUM(F4:F9)","v":0},0,0,0,0,0,0,0,0,0,0,0,0,0]
[null,null,"Celkové provozní náklady",0,{"$f":"'3 Provozní náklady'!E7","v":0},{"$f":"'3 Provozní náklady'!F7","v":0},{"$f":"'3 Provozní náklady'!G7","v":0},{"$f":"'3 Provozní náklady'!H7","v":0},{"$f":"'3 Provozní náklady'!I7","v":0},{"$f":"'3 Provozní náklady'!J7","v":0},{"$f":"'3 Provozní náklady'!K7","v":0},{"$f":"'3 Provozní náklady'!L7","v":0},{"$f":"'3 Provozní náklady'!M7","v":0},{"$f":"'3 Provozní náklady'!N7","v":0},{"$f":"'3 Provozní náklady'!O7","v":0},{"$f":"'3 Provozní náklady'!P7","v":0},{"$f":"'3 Provozní náklady'!Q7","v":0},{"$f":"'3 Provozní náklady'!R7","v":0},{"$f":"'3 Provozní náklady'!S7","v":0}]
[null,null,"Celkové investiční náklady",0,{"$f":"'1 Celkové investiční náklady'!G11","v":0},{"$f":"'1 Celkové investiční náklady'!H11","v":0},{"$f":"'1 Celkové investiční náklady'!I11","v":0},{"$f":"'1 Celkové investiční náklady'!J11","v":0},{"$f":"'1 Celkové investiční náklady'!K11","v":0},{"$f":"'1 Celkové investiční náklady'!L11","v":0},{"$f":"'1 Celkové investiční náklady'!M11","v":0},{"$f":"'1 Celkové investiční náklady'!N11","v":0},{"$f":"'1 Celkové investiční náklady'!O11","v":0},{"$f":"'1 Celkové investiční náklady'!P11","v":0},{"$f":"'1 Celkové investiční náklady'!Q11","v":0},{"$f":"'1 Celkové investiční náklady'!R11","v":0},{"$f":"'1 Celkové investiční náklady'!S11","v":0},{"$f":"'1 Celkové investiční náklady'!T11","v":0},{"$f":"'1 Celkové investiční náklady'!U11","v":0}]
[null,null,"Splácení jistiny úvěru",0]
[null,null,"Splácení úroků z úvěru",0]
[null,null,"Celkové výdaje",0,{"$f":"SUM(E11:E14)","v":0},{"$f":"SUM(F11:F14)","v":0},0,0,0,0,0,0,0,0,0,0,0,0,0]
[null,null,"Cash Flow pro příslušný rok",0,{"$f":"E10-E15","v":0},0,0,0,0,0,0,0,0,0,0,0,0,0,0]
[null,null,"Kumulované Cash Flow ",null,{"$f":"E16","v":0},{"$f":"F16+E17","v":0},{"$f":"G16+F17","v":0},0,0,0,0,0,0,0,0,0,0,0,0]
[]
[null,"9.1.","Udržitelnost projektu (CZK)",null,{"$f":"S2+1","v":2031},{"$f":"E19+1","v":2032},2033,2034,2035,2036,2037,2038,2039,2040,2041,2042,2043,2044,2045]
[null,"b","Stálé ceny"]
[null,null,"Provozní příjmy",null,{"$f":"'4 Tržby'!E14","v":0},{"$f":"'4 Tržby'!F14","v":0},{"$f":"'4 Tržby'!G14","v":0},{"$f":"'4 Tržby'!H14","v":0},{"$f":"'4 Tržby'!I14","v":0},{"$f":"'4 Tržby'!J14","v":0},{"$f":"'4 Tržby'!K14","v":0},{"$f":"'4 Tržby'!L14","v":0},{"$f":"'4 Tržby'!M14","v":0},{"$f":"'4 Tržby'!N14","v":0},{"$f":"'4 Tržby'!O14","v":0},{"$f":"'4 Tržby'!P14","v":0},{"$f":"'4 Tržby'!Q14","v":0},{"$f":"'4 Tržby'!R14","v":0},{"$f":"'4 Tržby'!S14","v":0}]
[null,null,"Úvěry",null,{"$f":"'8 Finanční struktura'!E22","v":0},{"$f":"'8 Finanční struktura'!F22","v":0},{"$f":"'8 Finanční struktura'!G22","v":0},{"$f":"'8 Finanční struktura'!H22","v":0},{"$f":"'8 Finanční struktura'!I22","v":0},{"$f":"'8 Finanční struktura'!J22","v":0},{"$f":"'8 Finanční struktura'!K22","v":0},{"$f":"'8 Finanční struktura'!L22","v":0},{"$f":"'8 Finanční struktura'!M22","v":0},{"$f":"'8 Finanční struktura'!N22","v":0},{"$f":"'8 Finanční struktura'!O22","v":0},{"$f":"'8 Finanční struktura'!P22","v":0},{"$f":"'8 Finanční struktura'!Q22","v":0},{"$f":"'8 Finanční struktura'!R22","v":0},{"$f":"'8 Finanční struktura'!S22","v":0}]
[null,null,"Celkové zdroje žadatele",null,{"$f":"'8 Finanční struktura'!E21","v":0},{"$f":"'8 Finanční struktura'!F21","v":0},{"$f":"'8 Finanční struktura'!G21","v":0},{"$f":"'8 Finanční struktura'!H21","v":0},{"$f":"'8 Finanční struktura'!S21","v":0},{"$f":"'8 Finanční struktura'!T21","v":0},{"$f":"'8 Finanční struktura'!U21","v":0},{"$f":"'8 Finanční struktura'!V21","v":0},{"$f":"'8 Finanční struktura'!W21","v":0},{"$f":"'8 Finanční struktura'!X21","v":0},{"$f":"'8 Finanční struktura'!Y21","v":0},{"$f":"'8 Finanční struktura'!Z21","v":0},{"$f":"'8 Finanční struktura'!AA21","v":0},{"$f":"'8 Finanční struktura'!AB21","v":0},{"$f":"'8 Finanční struktura'!AC21","v":0}]
[null,null,"Zdroje státního rozpočtu",null,{"$f":"'8 Finanční struktura'!E23","v":0},{"$f":"'8 Finanční struktura'!F23","v":0},{"$f":"'8 Finanční struktura'!G23","v":0},{"$f":"'8 Finanční struktura'!H23","v":0},{"$f":"'8 Finanční struktura'!S23","v":0},{"$f":"'8 Finanční struktura'!T23","v":0},{"$f":"'8 Finanční struktura'!U23","v":0},{"$f":"'8 Finanční struktura'!V23","v":0},{"$f":"'8 Finanční struktura'!W23","v":0},{"$f":"'8 Finanční struktura'!X23","v":0},{"$f":"'8 Finanční struktura'!Y23","v":0},{"$f":"'8 Finanční struktura'!Z23","v":0},{"$f":"'8 Finanční struktura'!AA23","v":0},{"$f":"'8 Finanční struktura'!AB23","v":0},{"$f":"'8 Finanční struktura'!AC23","v":0}]
[" ",null,"Granty EU",null,{"$f":"'8 Finanční struktura'!E25","v":0},{"$f":"'8 Finanční struktura'!F25","v":0},{"$f":"'8 Finanční struktura'!G25","v":0},{"$f":"'8 Finanční struktura'!H25","v":0},{"$f":"'8 Finanční struktura'!S25","v":0},{"$f":"'8 Finanční struktura'!T25","v":0},{"$f":"'8 Finanční struktura'!U25","v":0},{"$f":"'8 Finanční struktura'!V25","v":0},{"$f":"'8 Finanční struktura'!W25","v":0},{"$f":"'8 Finanční struktura'!X25","v":0},{"$f":"'8 Finanční struktura'!Y25","v":0},{"$f":"'8 Finanční struktura'!Z25","v":0},{"$f":"'8 Finanční struktura'!AA25","v":0},{"$f":"'8 Finanční struktura'!AB25","v":0},{"$f":"'8 Finanční struktura'!AC25","v":0}]
[null,null,"Dotace",null,{"$f":"'6 Kontrola dotací'!E14","v":0},{"$f":"'6 Kontrola dotací'!F14","v":0},{"$f":"'6 Kontrola dotací'!G14","v":0},{"$f":"'6 Kontrola dotací'!H14","v":0},{"$f":"'6 Kontrola dotací'!I14","v":0},{"$f":"'6 Kontrola dotací'!J14","v":0},{"$f":"'6 Kontrola dotací'!K14","v":0},{"$f":"'6 Kontrola dotací'!L14","v":0},{"$f":"'6 Kontrola dotací'!M14","v":0},{"$f":"'6 Kontrola dotací'!N14","v":0},{"$f":"'6 Kontrola dotací'!O14","v":0},{"$f":"'6 Kontrola dotací'!P14","v":0},{"$f":"'6 Kontrola dotací'!Q14","v":0},{"$f":"'6 Kontrola dotací'!R14","v":0},{"$f":"'6 Kontrola dotací'!S14","v":0}]
[null,null,"Celkové příjmy",null,{"$f":"SUM(E21:E26)","v":0},{"$f":"SUM(F21:F26)","v":0},0,0,0,0,0,0,0,0,0,0,0,0,0]
[null,null,"Celkové provozní náklady",null,{"$f":"'3 Provozní náklady'!E14","v":0},{"$f":"'3 Provozní náklady'!F14","v":0},{"$f":"'3 Provozní náklady'!G14","v":0},{"$f":"'3 Provozní náklady'!H14","v":0},{"$f":"'3 Provozní náklady'!I14","v":0},{"$f":"'3 Provozní náklady'!J14","v":0},{"$f":"'3 Provozní náklady'!K14","v":0},{"$f":"'3 Provozní náklady'!L14","v":0},{"$f":"'3 Provozní náklady'!M14","v":0},{"$f":"'3 Provozní náklady'!N14","v":0},{"$f":"'3 Provozní náklady'!O14","v":0},{"$f":"'3 Provozní náklady'!P14","v":0},{"$f":"'3 Provozní náklady'!Q14","v":0},{"$f":"'3 Provozní náklady'!R14","v":0},{"$f":"'3 Provozní náklady'!S14","v":0}]
[null,null,"Celkové investiční náklady",null,{"$f":"'1 Celkové investiční náklady'!G26","v":0},{"$f":"'1 Celkové investiční náklady'!H26","v":0},{"$f":"'1 Celkové investiční náklady'!I26","v":0},{"$f":"'1 Celkové investiční náklady'!J26","v":0},{"$f":"'1 Celkové investiční náklady'!K26","v":0},{"$f":"'1 Celkové investiční náklady'!L26","v":0},{"$f":"'1 Celkové investiční náklady'!M26","v":0},{"$f":"'1 Celkové investiční náklady'!N26","v":0},{"$f":"'1 Celkové investiční náklady'!O26","v":0},{"$f":"'1 Celkové investiční náklady'!P26","v":0},{"$f":"'1 Celkové investiční náklady'!Q26","v":0},{"$f":"'1 Celkové investiční náklady'!R26","v":0},{"$f":"'1 Celkové investiční náklady'!S26","v":0},{"$f":"'1 Celkové investiční náklady'!T26","v":0},{"$f":"'1 Celkové investiční náklady'!U26","v":0}]
[null,null,"Splácení jistiny úvěru"]
[null,null,"Splácení úroků z úvěru"]
[null,null,"Celkové výdaje",null,{"$f":"SUM(E28:E31)","v":0},{"$f":"SUM(F28:F31)","v":0},0,0,0,0,0,0,0,0,0,0,0,0,0]
[null,null,"Cash Flow pro příslušný rok",null,{"$f":"E27-E32","v":0},0,0,0,0,0,0,0,0,0,0,0,0,0,0]
[null,null,"Kumulované Cash Flow ",null,{"$f":"E33+S17","v":0},{"$f":"F33+E34","v":0},{"$f":"G33+F34","v":0},0,0,0,0,0,0,0,0,0,0,0,0]

{"sheet":"10 FRR_K","index":10,"n_rows":33,"n_cols":19,"rows_kept":33,"cut":false,"hidden":false,"merged":[[29,1,30,3],[13,15,14,15],[13,4,14,4],[13,5,14,5],[13,6,14,6],[13,7,14,7],[13,8,14,8],[1,8,2,8],[1,10,2,10],[1,14,2,14],[13,11,14,11],[13,12,14,12],[13,13,14,13],[1,12,2,12],[13,14,14,14],[1,4,2,4],[1,18,2,18],[13,9,14,9],[13,10,14,10],[13,18,14,18],[1,5,2,5],[1,13,2,13],[1,15,2,15],[1,16,2,16],[1,17,2,17],[13,16,14,16],[13,17,14,17],[1,6,2,6],[1,7,2,7],[1,9,2,9],[1,11,2,11]]}
[]
[null,"10.1.","Kalkulace finančního vnitřního výnosového procenta",null,{"$f":"'0 Úvod'!G19","v":2016},{"$f":"E2+1","v":2017},2018,2019,2020,2021,2022,2023,2024,2025,2026,2027,2028,2029,2030]
[null,"a","kapitálu - FRR/K (CZK)","Celkem"]
[null,null,"Zůstatková hodnota",{"$f":"SUM(E4:S4,E16:S16)","v":{"$error":"#DIV/0!"}},{"$f":"-1*'5 Finanční analýza (FRR_C)'!E8","v":0},{"$f":"-1*'5 Finanční analýza (FRR_C)'!F8","v":0},{"$f":"-1*'5 Finanční analýza (FRR_C)'!G8","v":0},{"$f":"-1*'5 Finanční analýza (FRR_C)'!H8","v":0},{"$f":"-1*'5 Finanční analýza (FRR_C)'!I8","v":0},{"$f":"-1*'5 Finanční analýza (FRR_C)'!J8","v":0},{"$f":"-1*'5 Finanční analýza (FRR_C)'!K8","v":0},{"$f":"-1*'5 Finanční analýza (FRR_C)'!L8","v":0},{"$f":"-1*'5 Finanční analýza (FRR_C)'!M8","v":0},{"$f":"-1*'5 Finanční analýza (FRR_C)'!N8","v":0},{"$f":"-1*'5 Finanční analýza (FRR_C)'!O8","v":0},{"$f":"-1*'5 Finanční analýza (FRR_C)'!P8","v":0},{"$f":"-1*'5 Finanční analýza (FRR_C)'!Q8","v":0},{"$f":"-1*'5 Finanční analýza (FRR_C)'!R8","v":0},{"$f":"-1*'5 Finanční analýza (FRR_C)'!S8","v":0}]
[null,null,"Přírůstek celkových provozních příjmů",{"$f":"SUM(E5:S5,E17:S17)","v":0},{"$f":"'7 Mezera ve financování'!E5","v":0},{"$f":"'7 Mezera ve financování'!F5","v":0},{"$f":"'7 Mezera ve financování'!G5","v":0},{"$f":"'7 Mezera ve financování'!H5","v":0},{"$f":"'7 Mezera ve financování'!I5","v":0},{"$f":"'7 Mezera ve financování'!J5","v":0},{"$f":"'7 Mezera ve financování'!K5","v":0},{"$f":"'7 Mezera ve financování'!L5","v":0},{"$f":"'7 Mezera ve financování'!M5","v":0},{"$f":"'7 Mezera ve financování'!N5","v":0},{"$f":"'7 Mezera ve financování'!O5","v":0},{"$f":"'7 Mezera ve financování'!P5","v":0},{"$f":"'7 Mezera ve financování'!Q5","v":0},{"$f":"'7 Mezera ve financování'!R5","v":0},{"$f":"'7 Mezera ve financování'!S5","v":0}]
[null,null,"Celkové příjmy",{"$f":"SUM(D4:D5)","v":{"$error":"#DIV/0!"}},{"$f":"SUM(E4:E5)","v":0},{"$f":"SUM(F4:F5)","v":0},0,0,0,0,0,0,0,0,0,0,0,0,0]
[null,null,"Přírůstkové celkové provozní náklady*",{"$f":"SUM(E7:S7,E19:S19)","v":0},{"$f":"'6 Kontrola dotací'!E37","v":0},{"$f":"'6 Kontrola dotací'!F37","v":0},{"$f":"'6 Kontrola dotací'!G37","v":0},{"$f":"'6 Kontrola dotací'!H37","v":0},{"$f":"'6 Kontrola dotací'!I37","v":0},{"$f":"'6 Kontrola dotací'!J37","v":0},{"$f":"'6 Kontrola dotací'!K37","v":0},{"$f":"'6 Kontrola dotací'!L37","v":0},{"$f":"'6 Kontrola dotací'!M37","v":0},{"$f":"'6 Kontrola dotací'!N37","v":0},{"$f":"'6 Kontrola dotací'!O37","v":0},{"$f":"'6 Kontrola dotací'!P37","v":0},{"$f":"'6 Kontrola dotací'!Q37","v":0},{"$f":"'6 Kontrola dotací'!R37","v":0},{"$f":"'6 Kontrola dotací'!S37","v":0}]
[null,null,"Příspěvky žadatele + národní zdroje",{"$f":"SUM(E8:S8,E20:S20)","v":0},{"$f":"'8 Finanční struktura'!E6+'8 Finanční struktura'!E9","v":0},{"$f":"'8 Finanční struktura'!F6+'8 Finanční struktura'!F9","v":0},{"$f":"'8 Finanční struktura'!G6+'8 Finanční struktura'!G9","v":0},{"$f":"'8 Finanční struktura'!H6+'8 Finanční struktura'!H9","v":0},{"$f":"'8 Finanční struktura'!I6+'8 Finanční struktura'!I9","v":0},{"$f":"'8 Finanční struktura'!J6+'8 Finanční struktura'!J9","v":0},{"$f":"'8 Finanční struktura'!K6+'8 Finanční struktura'!K9","v":0},{"$f":"'8 Finanční struktura'!L6+'8 Finanční struktura'!L9","v":0},{"$f":"'8 Finanční struktura'!M6+'8 Finanční struktura'!M9","v":0},{"$f":"'8 Finanční struktura'!N6+'8 Finanční struktura'!N9","v":0},{"$f":"'8 Finanční struktura'!O6+'8 Finanční struktura'!O9","v":0},{"$f":"'8 Finanční struktura'!P6+'8 Finanční struktura'!P9","v":0},{"$f":"'8 Finanční struktura'!Q6+'8 Finanční struktura'!Q9","v":0},{"$f":"'8 Finanční struktura'!R6+'8 Finanční struktura'!R9","v":0},{"$f":"'8 Finanční struktura'!S6+'8 Finanční struktura'!S9","v":0}]
[null,null,"Celkové náklady",{"$f":"SUM(D7:D8)","v":0},{"$f":"SUM(E7:E8)","v":0},0,0,0,0,0,0,0,0,0,0,0,0,0,0]
[null,null,"Cash Flow ",null,{"$f":"E6-E9","v":0},0,0,0,0,0,0,0,0,0,0,0,0,0,0]
[null,null,"Diskontní sazba",{"$f":"'0 Úvod'!D21","v":0.04},1,{"$f":"E11/(1+$D$11)","v":0.96153846153846145},{"$f":"F11/(1+$D$11)","v":0.92455621301775137},0.88899635867091475,0.85480419102972571,0.82192710675935166,0.79031452573014582,0.75991781320206331,0.73069020500198389,0.70258673557883067,0.67556416882579873,0.64958093156326802,0.62459704958006534,0.60057408613467822,0.57747508282180593]
[null,null,"Diskontované cash flow",{"$f":"SUM(E12:S12,E24:S24)","v":{"$error":"#DIV/0!"}},{"$f":"E10*E11","v":0},{"$f":"F10*F11","v":0},0,0,0,0,0,0,0,0,0,0,0,0,0]
[]
[null,"10.1.",{"$f":"C2","v":"Kalkulace finančního vnitřního výnosového procenta"},null,{"$f":"S2+1","v":2031},{"$f":"E14+1","v":2032},2033,2034,2035,2036,2037,2038,2039,2040,2041,2042,2043,2044,2045]
[null,"b",{"$f":"C3","v":"kapitálu - FRR/K (CZK)"}]
[null,null,{"$f":"C4","v":"Zůstatková hodnota"},null,{"$f":"-1*'5 Finanční analýza (FRR_C)'!E20","v":0},{"$f":"-1*'5 Finanční analýza (FRR_C)'!F20","v":0},{"$f":"-1*'5 Finanční analýza (FRR_C)'!G20","v":0},{"$f":"-1*'5 Finanční analýza (FRR_C)'!H20","v":0},{"$f":"-1*'5 Finanční analýza (FRR_C)'!I20","v":0},{"$f":"-1*'5 Finanční analýza (FRR_C)'!J20","v":0},{"$f":"-1*'5 Finanční analýza (FRR_C)'!K20","v":0},{"$f":"-1*'5 Finanční analýza (FRR_C)'!L20","v":0},{"$f":"-1*'5 Finanční analýza (FRR_C)'!M20","v":0},{"$f":"-1*'5 Finanční analýza (FRR_C)'!N20","v":0},{"$f":"-1*'5 Finanční analýza (FRR_C)'!O20","v":0},{"$f":"-1*'5 Finanční analýza (FRR_C)'!P20","v":0},{"$f":"-1*'5 Finanční analýza (FRR_C)'!Q20","v":0},{"$f":"-1*'5 Finanční analýza (FRR_C)'!R20","v":0},{"$f":"-1*'5 Finanční analýza (FRR_C)'!S20","v":{"$error":"#DIV/0!"}}]
[null,null,"Přírůstek celkových provozních příjmů",null,{"$f":"'7 Mezera ve financování'!E15","v":0},{"$f":"'7 Mezera ve financování'!F15","v":0},{"$f":"'7 Mezera ve financování'!G15","v":0},{"$f":"'7 Mezera ve financování'!H15","v":0},{"$f":"'7 Mezera ve financování'!I15","v":0},{"$f":"'7 Mezera ve financování'!J15","v":0},{"$f":"'7 Mezera ve financování'!K15","v":0},{"$f":"'7 Mezera ve financování'!L15","v":0},{"$f":"'7 Mezera ve financování'!M15","v":0},{"$f":"'7 Mezera ve financování'!N15","v":0},{"$f":"'7 Mezera ve financování'!O15","v":0},{"$f":"'7 Mezera ve financování'!P15","v":0},{"$f":"'7 Mezera ve financování'!Q15","v":0},{"$f":"'7 Mezera ve financování'!R15","v":0},{"$f":"'7 Mezera ve financování'!S15","v":0}]
[null,null,"Celkové příjmy",null,{"$f":"SUM(E16:E17)","v":0},{"$f":"SUM(F16:F17)","v":0},0,0,0,0,0,0,0,0,0,0,0,0,{"$error":"#DIV/0!"}]
[null,null,"Přírůstkové celkové provozní náklady*",null,{"$f":"'6 Kontrola dotací'!E44","v":0},{"$f":"'6 Kontrola dotací'!F44","v":0},{"$f":"'6 Kontrola dotací'!G44","v":0},{"$f":"'6 Kontrola dotací'!H44","v":0},{"$f":"'6 Kontrola dotací'!I44","v":0},{"$f":"'6 Kontrola dotací'!J44","v":0},{"$f":"'6 Kontrola dotací'!K44","v":0},{"$f":"'6 Kontrola dotací'!L44","v":0},{"$f":"'6 Kontrola dotací'!M44","v":0},{"$f":"'6 Kontrola dotací'!N44","v":0},{"$f":"'6 Kontrola dotací'!O44","v":0},{"$f":"'6 Kontrola dotací'!P44","v":0},{"$f":"'6 Kontrola dotací'!Q44","v":0},{"$f":"'6 Kontrola dotací'!R44","v":0},{"$f":"'6 Kontrola dotací'!S44","v":0}]
[null,null,"Příspěvky žadatele + národní zdroje",null,{"$f":"'8 Finanční struktura'!E21+'8 Finanční struktura'!E24","v":0},{"$f":"'8 Finanční struktura'!F21+'8 Finanční struktura'!F24","v":0},{"$f":"'8 Finanční struktura'!G21+'8 Finanční struktura'!G24","v":0},{"$f":"'8 Finanční struktura'!H21+'8 Finanční struktura'!H24","v":0},{"$f":"'8 Finanční struktura'!I21+'8 Finanční struktura'!I24","v":0},{"$f":"'8 Finanční struktura'!J21+'8 Finanční struktura'!J24","v":0},{"$f":"'8 Finanční struktura'!K21+'8 Finanční struktura'!K24","v":0},{"$f":"'8 Finanční struktura'!L21+'8 Finanční struktura'!L24","v":0},{"$f":"'8 Finanční struktura'!M21+'8 Finanční struktura'!M24","v":0},{"$f":"'8 Finanční struktura'!N21+'8 Finanční struktura'!N24","v":0},{"$f":"'8 Finanční struktura'!O21+'8 Finanční struktura'!O24","v":0},{"$f":"'8 Finanční struktura'!P21+'8 Finanční struktura'!P24","v":0},{"$f":"'8 Finanční struktura'!Q21+'8 Finanční struktura'!Q24","v":0},{"$f":"'8 Finanční struktura'!R21+'8 Finanční struktura'!R24","v":0},{"$f":"'8 Finanční struktura'!S21+'8 Finanční struktura'!S24","v":0}]
[null,null,"Celkové náklady",null,{"$f":"SUM(E19:E20)","v":0},0,0,0,0,0,0,0,0,0,0,0,0,0,0]
[null,null,"Cash Flow ",null,{"$f":"E18-E21","v":0},0,0,0,0,0,0,0,0,0,0,0,0,0,{"$error":"#DIV/0!"}]
[null,null,"Diskontní sazba",{"$f":"D11","v":0.04},{"$f":"S11*1/(1+$D$11)","v":0.55526450271327488},{"$f":"E23*1/(1+$D$11)","v":0.53390817568584126},{"$f":"F23*1/(1+$D$11)","v":0.51337324585177047},0.49362812101131776,0.47464242404934398,0.45638694620129228,0.4388336021166272,0.42195538665060306,0.40572633331788754,0.39012147434412264,0.37511680225396404,0.3606892329365039,0.34681657013125372,0.33347747128005162,0.32065141469235731]
[null,null,"Diskontované cash flow",null,{"$f":"E22*E23","v":0},0,0,0,0,0,0,0,0,0,0,0,0,0,{"$error":"#DIV/0!"}]
[]
[null,"Finanční vniřní výnosové procento kapitálu FRR/K**",null,null,{"$f":"ROUND(IRR((E10:S10,E22:S22),0.05),4)","v":{"$error":"#VALUE!"}},null,{"$f":"IF('8 Finanční struktura'!T11=\"OK\",\"\",\"CHYBA!\")","v":""}]
[null,"Finanční čistá současná hodnota kapitálu FNPV/K (CZK)",null,null,{"$f":"SUM(E12:S12,E24:S24)","v":{"$error":"#DIV/0!"}}]
[null,"Finanční čistá současná hodnota kapitálu FNPV/K (EUR)",null,null,{"$f":"E27/'0 Úvod'!N19","v":{"$error":"#DIV/0!"}}]
[]
[null,"Komentáře"]
[]
[null,"* čistá úspora prov. nákladů po odečtení úspory dotace (dle listu 6)"]
[null,"** pokud se zobrazí \"CHYBA\", zkonrolujte list 8 Finanční struktura"]